program: Gaussian 09
title: 000282815
version: EM64L-G09RevD.01
frameworkgroup: C1[X(C8H11NO2S2)]
method: RPBEPBE
basis: SDD
operation: Freq
keyword: #p
keyword: freq=noraman
keyword: PBEPBE/SDD
title: #p freq=noraman PBEPBE/SDD
converged: YES YES NO NO
title: Mulliken charges:
elementType: S S O O N C C C C C C C C H H H H H H H H H H H
charge: 0.155896 0.238477 -0.425478 -0.237501 -0.619045 -0.102264 -0.703704 -0.790421 0.037942 0.242299 -0.267022 -0.124636 -0.516266 0.250952 0.257234 0.281670 0.327910 0.271749 0.301287 0.280050 0.253471 0.243281 0.261823 0.382293
chargesum: 0.00000
title: Mulliken charges with hydrogens summed into heavy atoms:
elementType: S S O O N C C C C C C C C
charge: 0.155896 0.238477 -0.043185 -0.237501 -0.037708 0.148689 -0.164799 -0.190762 0.037942 0.242299 -0.013551 0.118646 -0.254443
polarizability: 1.92147188e+02 -4.76915674e+00 1.23238898e+02 -2.09484263e+00 -9.91977172e+00 8.42430970e+01
1716.lowfreq: -11.1417 -5.6285 0.0014 0.0033 0.0034 3.8486 14.9908 24.1335 36.5161
frequency: 14.9590 23.9110 36.4213 50.1351 91.8516 108.7710 147.8086 193.4912 237.8699 251.3793 258.1846 291.6643 304.4132 382.8546 464.7128 467.6876 542.4389 557.2252 573.9225 582.3090 619.7834 636.7444 657.9478 687.0660 698.5138 703.8194 734.2911 764.9019 821.9683 834.0705 897.1273 907.9844 918.3080 993.2260 1035.5609 1051.2078 1078.2419 1087.7290 1112.4361 1153.9056 1196.4576 1210.2542 1237.6622 1242.1423 1252.6565 1263.2340 1305.2785 1344.4062 1391.6278 1430.8020 1464.0255 1474.0004 1553.2333 1628.3029 1673.7443 2900.6385 3029.0573 3030.3906 3107.2285 3108.5106 3165.7414 3184.6947 3236.5047 3462.0331 3514.6064 3594.6184
redmass: 7.4415 6.3066 5.4673 8.6520 6.6528 5.3342 7.1232 4.0253 1.2318 3.8303 4.2900 2.4526 2.7611 5.3998 5.0430 4.6026 3.5521 3.7182 6.3449 1.3283 4.9379 1.4643 4.4799 3.6722 1.2083 6.1471 4.3311 2.7616 4.2868 1.3375 1.5199 1.4477 1.9114 3.1446 1.7090 2.3004 1.2333 2.4870 1.2191 1.1339 2.1461 1.4565 1.3124 1.2083 1.1858 1.6634 1.3539 2.2477 1.9186 1.0961 1.1397 5.7959 6.0536 1.0952 8.8898 1.0811 1.0570 1.0594 1.1089 1.1052 1.0905 1.0971 1.1003 1.0446 1.0640 1.0985
irintensity: 0.1671 1.1729 2.4733 2.4749 2.2203 3.3908 2.0871 1.3850 43.8984 0.1663 4.4791 17.6964 1.0262 12.5266 11.3933 30.2996 11.6192 0.1212 10.6733 37.9340 2.8136 308.6194 30.4855 42.6662 117.6192 5.9363 9.9753 2.4080 8.8654 11.6676 2.4035 0.4630 9.4182 20.5754 40.7645 296.1915 5.8680 25.0296 3.4444 3.9168 3.2263 1.4825 38.4465 3.7860 1.2377 19.5211 9.2631 1.7477 12.2368 22.0666 5.1308 6.2351 0.7907 48.2877 232.7950 45.2404 23.4275 24.8425 7.6070 5.8151 6.9126 6.0696 1.0719 3.1664 26.7410 4.9292
temp: 298.150 k
press: 1.00000 atm
elementType: 16 16 8 8 7 6 6 6 6 6 6 6 6 1 1 1 1 1 1 1 1 1 1 1
symmnumber: 1
zpe: 472397.5 jmol-1
zpe.correction: 0.179927 hartree
zpe.thermalcorrener: 0.194397 hartree
zpe.thermalcorrenthalpy: 0.195341 hartree
zpe.thermalcorrgfe: 0.135035 hartree
zpe.sumelectzpe: -1311.757640 hartree
zpe.sumelectthermal: -1311.743169 hartree
zpe.sumelectthermalent: -1311.742225 hartree
zpe.sumelectthermalfe: -1311.802531 hartree
dipole: 1.6683 0.0223 -0.3225
dipole: 1.6993
quadrupole: -72.8802 -82.7626 -96.8612
quadrupole: 0.7210 -4.2979 -3.1901
quadrupole: 11.2878 1.4054 -12.6932 0.7210 -4.2979 -3.1901
hfenergy: -1311.9375663 hartree
pointgroup: C01 [X(C8H11N1O2S2)]
dipole: -0.6630637 0.0058218 -0.0853908 debye
dipolederiv: -0.442388 0.0103385 -0.0810557 -0.0009893 -0.2053114 0.0502457 -0.1436503 0.0675895 -0.0601207 -0.1418293 -0.141221 0.0795912 -0.0888036 -0.1967653 0.0161422 0.089935 0.0152031 0.1131426 -0.8172259 -0.3943361 0.074442 -0.6287209 -0.9111475 -0.0195955 0.1186323 0.0154029 -0.2916012 -0.8519214 -0.2647107 -0.133463 -0.1502639 -0.4856035 0.143979 -0.3282553 -0.0367331 -0.6271274 -0.7951478 0.094177 0.1107505 0.0186316 -0.4045014 -0.1476496 0.1368581 -0.1825056 -0.5840772 0.5280034 -0.1150791 -0.1814378 0.0847937 0.1321976 0.1383338 0.0024515 0.1340278 0.2168781 0.2998628 -0.0039724 -0.0478011 -0.0827835 0.0788622 -0.0231412 -0.1632439 0.004586 0.0135428 0.4887398 -0.1355689 0.2172819 -0.0919003 0.0918853 -0.0049013 0.3762581 -0.0466866 0.1720572 -0.0576664 0.0977431 -0.0549563 -0.0181316 0.4266288 -0.0777275 -0.0871528 -0.0275614 -0.2330354 1.1787308 0.5699054 0.2784339 0.7238333 1.0442946 -0.2598111 0.3534595 -0.130241 0.6940837 -0.1153446 -0.1270744 0.0100104 -0.0051076 -0.0324584 0.0055965 -0.0319332 0.0194404 -0.1534457 -0.0122333 -0.0168896 -0.033438 -0.0229186 -0.1821636 0.0526523 -0.0146606 0.0012836 -0.1383445 0.1180213 0.202754 -0.1559975 0.1836491 -0.046492 -0.0391218 -0.1107773 -0.0419235 -0.2918601 -0.0285455 0.05129 0.0354395 0.0715854 -0.0544634 -0.0871486 0.0823707 -0.1087642 -0.092729 -0.1113224 0.1066023 -0.0373145 0.0640652 -0.02014 0.0758948 -0.0177105 0.0914723 0.020698 0.0029608 -0.0220056 0.0042315 -0.0199336 0.0703215 -0.042674 0.0131365 -0.1038313 -0.0280244 0.1034622 0.0609814 -0.0160917 0.0418473 0.0755434 0.0329353 -0.0691466 0.0285715 -0.0000937 -0.0341614 -0.0145781 -0.0658763 -0.0018188 -0.0846365 -0.0658604 -0.0823521 -0.034615 0.0260126 0.0830881 -0.0444876 0.0187772 -0.0979639 0.1256855 0.0266315 -0.1044913 0.0108751 0.3412215 0.1998274 0.0300839 -0.0096185 0.0223156 0.2151139 0.123895 -0.0399196 0.1979089 0.1390137 0.1253888 -0.0295159 0.0252062 -0.0152689 -0.0696528 0.0122374 0.0162125 0.0184807 0.1812371 -0.0811549 -0.0222189 0.0510168 -0.0597568 0.0995265 0.016392 0.0650982 0.0038441 0.1846612 0.0365022 0.0631706 0.0329547 0.0412278 0.0224666 -0.0015561 0.0367102 -0.0039961 0.2138537 0.3243533 0.0446121 -0.1210854 0.0324123 0.3108099 0.0742519 -0.0978288 0.1081719 0.1840572 unknown
polarizability: 190.7879046|-10.7146187|125.1872051|-1.1243711|-8.7845873|83.6540729 unknown
InChI: InChI=1S/C8H11NO2S2/c9-7(8(10)11)5-12-4-6-2-1-3-13-6/h1-3,7,10H,4-5,9H2
charge 0 multiplicity 1
24 atoms
S  -0.168754 1.027944 -1.374189
S  2.247195 -1.514439 0.024506
O  -3.433517 -1.604098 0.567581
O  -1.645755 -0.422045 1.447176
N  -4.204658 0.970962 -0.317546
C  -2.850585 0.427171 -0.575927
C  -1.829416 1.577834 -0.64542
C  0.929863 1.037224 0.214432
C  2.200968 0.298398 -0.022211
C  -2.533259 -0.530112 0.576722
C  3.463276 0.805702 -0.308936
C  4.480965 -0.201531 -0.484259
C  4.002274 -1.494047 -0.339776
H  -2.775927 -0.169092 -1.516375
H  -2.211803 2.370119 -1.311695
H  -1.658008 2.009948 0.353457
H  0.304064 0.585835 1.000216
H  1.143553 2.091202 0.455012
H  -4.918502 0.249507 -0.175528
H  -4.4911 1.690203 -0.988276
H  3.654087 1.879075 -0.392709
H  5.526047 0.02561 -0.708037
H  4.538355 -2.438292 -0.417558
H  -3.242162 -2.207077 1.336344
