program: Gaussian 09
title: 000282852
version: EM64L-G09RevD.01
frameworkgroup: C1[X(C16H15NO2)]
method: RPBEPBE
basis: SDD
operation: Freq
keyword: #p
keyword: freq=noraman
keyword: PBEPBE/SDD
title: #p freq=noraman PBEPBE/SDD
converged: YES YES NO NO
title: Mulliken charges:
elementType: O O N C C C C C C C C C C C C C C C C H H H H H H H H H H H H H H H
charge: -0.256661 -0.250922 -0.454475 0.373602 0.334902 0.477421 -0.378421 -0.395959 -0.470972 -0.367474 -0.395127 -0.394131 -0.623713 0.177907 -0.235917 -0.236558 -0.243669 0.283434 -0.765153 0.237920 0.237430 0.232966 0.303774 0.361619 0.235404 0.237925 0.272228 0.266020 0.224018 0.224527 0.228581 0.251727 0.262445 0.245302
chargesum: 0.00000
title: Mulliken charges with hydrogens summed into heavy atoms:
elementType: O O N C C C C C C C C C C C C C C C C
charge: -0.256661 -0.250922 -0.092856 0.373602 0.334902 0.477421 -0.140501 -0.158528 -0.238006 -0.063700 -0.159724 -0.156205 -0.085466 0.177907 -0.011899 -0.012031 -0.015089 0.283434 -0.005678
polarizability: 3.51924864e+02 -1.11674494e+01 1.77837729e+02 5.45257849e-01 -7.73067398e-01 9.06945144e+01
1716.lowfreq: -4.4170 -2.4771 -0.0011 -0.0005 0.0003 5.2117 21.2292 38.6743 49.6218
frequency: 21.2118 38.6631 49.6093 59.9681 75.0510 83.6776 118.5056 120.2145 150.4653 181.8013 222.7978 251.5829 307.5640 338.2843 361.2229 374.4673 405.4600 413.3849 431.3825 450.9864 499.7075 532.7309 550.2847 568.1955 592.7907 614.1961 636.3789 668.7053 701.3606 732.6568 739.0800 771.2799 812.3343 825.6689 836.3329 848.7404 861.0389 883.7221 897.9768 917.6395 931.1719 955.3438 972.3065 980.0824 986.0681 990.0575 992.3424 993.2167 1017.4201 1023.5671 1040.7939 1084.8019 1127.8989 1162.0247 1173.0566 1179.1102 1190.1808 1199.6420 1215.6248 1276.3781 1293.0972 1305.3778 1309.6012 1320.1466 1360.3737 1373.9080 1375.7513 1416.3341 1421.9784 1437.7974 1440.8729 1451.9157 1477.4269 1518.1368 1536.6959 1581.0778 1591.3784 1603.4496 1612.6051 1625.7215 1643.5758 2972.9988 2982.4417 3065.0729 3082.4020 3119.6364 3121.7633 3126.5499 3127.7868 3137.3037 3140.3378 3147.8759 3149.3694 3164.4415 3192.4209 3291.6213
redmass: 3.7413 4.0791 4.2519 5.5778 3.6859 3.6531 4.5817 5.3680 1.1858 6.6079 4.9378 4.9906 4.3590 4.7624 5.8125 4.6540 2.8569 2.9730 4.5730 2.4497 3.3323 4.5848 2.8700 3.4678 4.2897 6.4580 6.9110 5.4917 1.7362 3.1499 5.3455 1.9900 1.7868 1.8973 2.6206 1.2809 1.4384 2.0223 1.4552 1.4893 4.2327 1.3771 1.4345 1.9427 2.1686 2.0748 1.3146 5.9077 2.7415 1.8283 1.8866 1.6228 1.3738 1.5818 1.0527 1.7673 1.1171 1.2677 2.5952 2.0689 3.2958 1.4638 1.8125 1.4329 2.9623 1.2498 8.7648 1.1029 3.9396 2.3899 1.0753 1.0562 2.1952 2.7358 2.9324 4.4170 5.2613 7.3914 5.9841 6.1178 3.2019 1.0670 1.0388 1.0951 1.0911 1.0878 1.0846 1.0873 1.1004 1.0905 1.0919 1.0959 1.0955 1.1016 1.0946 1.0807
irintensity: 1.0445 0.8840 3.3745 1.8665 4.5460 7.5148 1.0801 4.3351 0.5133 6.1001 1.2805 10.5345 0.6285 6.0455 9.7137 0.1571 0.5307 0.0595 1.1382 4.0298 18.6662 19.6636 6.2952 2.1267 13.9633 0.3001 0.9869 6.1858 48.1793 16.2405 3.5342 64.8867 9.5435 0.4792 13.8994 0.9416 31.7477 40.7114 52.1958 1.6825 5.3546 6.6383 0.1776 13.5711 3.3064 1.9635 0.1012 5.8230 1.6001 21.5369 3.9820 8.8374 18.0294 30.1938 0.0694 4.5369 1.7111 11.0809 127.4344 36.0900 9.0168 28.8066 82.9192 11.8669 55.3209 83.7521 3.6646 55.4094 12.2417 12.3273 23.9212 19.8619 91.6153 2.7599 541.5523 152.5971 155.7938 78.3577 6.1858 9.6766 175.2014 2.3476 1.1580 8.3387 8.2131 22.7138 2.6434 2.3307 10.3601 17.1169 10.0168 18.5760 33.9193 30.2033 2.7954 366.2992
temp: 298.150 k
press: 1.00000 atm
elementType: 8 8 7 6 6 6 6 6 6 6 6 6 6 6 6 6 6 6 6 1 1 1 1 1 1 1 1 1 1 1 1 1 1 1
symmnumber: 1
zpe: 705542.3 jmol-1
zpe.correction: 0.268727 hartree
zpe.thermalcorrener: 0.285772 hartree
zpe.thermalcorrenthalpy: 0.286716 hartree
zpe.thermalcorrgfe: 0.221747 hartree
zpe.sumelectzpe: -822.588472 hartree
zpe.sumelectthermal: -822.571427 hartree
zpe.sumelectthermalent: -822.570482 hartree
zpe.sumelectthermalfe: -822.635452 hartree
dipole: -3.2389 -1.4592 -0.3842
dipole: 3.5732
quadrupole: -69.4825 -114.2979 -114.6635
quadrupole: 2.0345 0.3565 -3.4668
quadrupole: 29.9988 -14.8166 -15.1822 2.0345 0.3565 -3.4668
hfenergy: -822.8571984 hartree
pointgroup: C01 [X(C16H15N1O2)]
dipole: 1.2640248 -0.5155182 0.3357572 debye
polarizability: 351.1274446|13.8347211|174.5357113|11.8781783|-16.5831976|94.793951 unknown
InChI: InChI=1S/C16H15NO2/c1-12(18)11-16(19)17-15-9-7-14(8-10-15)13-5-3-2-4-6-13/h2-10,17H,11H2,1H3
charge 0 multiplicity 1
34 atoms
O  3.06003 2.212686 -0.527579
O  4.56194 -1.517851 0.984394
N  2.452669 0.162877 0.469136
C  -1.812342 -0.011668 0.078975
C  -3.295041 -0.095868 -0.043265
C  1.039359 0.15419 0.310689
C  -1.060736 -1.062041 0.6760
C  -1.092306 1.118169 -0.396456
C  0.337494 -0.984557 0.791506
C  0.308709 1.214119 -0.290261
C  -3.94595 -1.34836 -0.225456
C  -4.104198 1.073362 0.018047
C  4.829577 0.857512 0.449807
C  3.351939 1.132681 0.069291
C  -5.34995 -1.429705 -0.339629
C  -5.508073 0.994289 -0.099638
C  -6.140247 -0.258336 -0.278045
C  5.31475 -0.588724 0.564047
C  6.750755 -0.860579 0.162033
H  -1.579549 -1.936751 1.083261
H  -1.63461 1.931635 -0.891575
H  0.891702 -1.804439 1.265102
H  0.844659 2.084424 -0.67301
H  2.888517 -0.677575 0.891053
H  -3.345993 -2.261616 -0.310631
H  -3.632681 2.047578 0.190161
H  4.995459 1.331064 1.441948
H  5.452306 1.422845 -0.263078
H  -5.826824 -2.405338 -0.487679
H  -6.109613 1.908544 -0.041463
H  -7.230409 -0.320533 -0.36792
H  6.847329 -0.772617 -0.938003
H  7.052206 -1.873811 0.467995
H  7.434322 -0.111007 0.601542
