program: Gaussian 09
title: 000282838
version: EM64L-G09RevD.01
frameworkgroup: C1[X(C14H15NO2)]
method: RPBEPBE
basis: SDD
operation: Freq
keyword: #p
keyword: freq=noraman
keyword: PBEPBE/SDD
title: #p freq=noraman PBEPBE/SDD
converged: YES YES NO NO
title: Mulliken charges:
elementType: O O N C C C C C C C C C C C C C C H H H H H H H H H H H H H H H
charge: -0.253687 -0.258280 -0.039992 0.262441 0.383918 0.115852 -0.090589 -0.475636 -0.614876 -0.374368 -0.819466 -0.329068 -0.255871 -0.225943 0.282308 -0.265704 -0.663991 0.275172 0.274470 0.244862 0.240074 0.235456 0.240876 0.234729 0.263530 0.227315 0.231464 0.235057 0.226066 0.217895 0.228704 0.247283
chargesum: 0.00000
title: Mulliken charges with hydrogens summed into heavy atoms:
elementType: O O N C C C C C C C C C C C C C C
charge: -0.253687 -0.258280 -0.039992 0.262441 0.383918 0.115852 -0.090589 -0.200464 -0.095544 -0.134294 -0.108405 -0.065539 -0.028555 0.005521 0.282308 0.195418 0.029892
polarizability: 2.42500312e+02 -1.15029457e+01 1.69096118e+02 -1.79721677e+01 -1.83450582e+00 9.70528495e+01
1716.lowfreq: -14.1388 -8.4011 -3.4476 -0.0007 -0.0003 0.0004 11.4866 22.8698 40.5236
frequency: -1.7090 22.5431 40.4190 81.4788 98.6460 127.6634 156.4669 162.6843 192.3905 207.7989 233.8529 267.0205 287.5773 300.4757 354.9779 413.2361 423.9996 466.7284 483.7175 509.6961 523.9515 537.0162 564.1441 579.8202 653.0724 659.1499 713.8650 745.3270 770.5916 786.7319 802.2760 815.9986 841.7949 880.0194 894.5255 915.8382 943.7572 965.8267 969.1211 994.6207 995.6926 1016.3724 1022.6110 1046.6621 1068.0266 1093.4962 1101.7683 1125.8789 1156.1128 1171.1226 1190.3178 1217.5939 1249.7404 1272.1354 1277.3401 1297.7038 1336.3747 1354.9836 1358.8791 1389.6741 1391.6525 1400.9826 1417.8153 1443.3148 1453.7719 1455.6091 1462.5318 1469.8065 1479.3671 1483.7348 1509.9192 1550.6556 1597.1813 1621.0964 1628.5201 2977.2763 2993.0777 2996.7793 3031.3113 3053.3368 3088.5377 3093.7818 3095.7652 3120.3001 3120.5143 3127.7533 3140.7221 3155.8752 3156.3262 3170.0678
redmass: 3.9335 4.2358 3.3483 4.6652 4.2780 3.8719 2.7786 1.3486 1.5625 2.6520 2.5258 2.8123 3.0564 3.3766 3.2167 4.0681 3.1135 4.0663 4.0246 4.6855 4.2188 4.2924 3.8749 4.6451 4.6232 4.1025 4.1053 3.7177 1.3502 2.8856 1.9942 1.9741 4.8144 1.6540 2.1950 1.9585 2.6210 1.3683 2.9976 1.9685 1.3249 2.9054 2.5174 1.5780 2.3485 2.1936 1.9772 1.7290 1.6770 1.1366 1.6302 1.5353 1.7770 1.8807 1.1272 2.4574 3.5725 1.6565 2.0017 1.2334 2.5122 1.5336 2.9590 1.0908 2.4743 1.1054 1.0435 1.0463 1.2034 1.0511 4.0242 7.2844 6.1455 6.4705 8.8960 1.0380 1.0359 1.0662 1.0594 1.0970 1.0974 1.1030 1.0983 1.1022 1.0985 1.0850 1.0895 1.0939 1.0946 1.0995
irintensity: 1.9585 0.3373 0.9696 2.9756 0.1366 1.9719 3.5120 2.5552 2.9080 0.6893 1.8832 1.5910 3.6097 7.7608 13.3939 2.3645 7.2789 6.2220 1.6236 1.1488 0.9444 1.3821 2.1884 8.8158 0.5358 1.8086 8.9186 6.9156 83.6068 5.2261 4.8227 1.5219 1.8409 3.4778 37.3462 5.3003 4.3026 3.0599 5.7879 10.0849 0.3309 63.0897 19.8875 7.4139 6.3049 125.3758 131.9690 8.3221 14.7088 0.6185 3.3287 153.0292 2.5730 43.2750 8.1732 107.4012 8.8376 3.2108 29.7253 23.5403 8.1027 9.5316 33.2432 19.8964 0.6251 11.4174 14.5581 14.8994 30.6271 12.8570 26.2710 35.5726 66.7247 11.9070 139.7813 21.7048 21.9956 6.6716 26.7070 16.1655 34.9329 1.2885 17.1881 14.3830 18.4417 0.4152 11.1464 5.4892 24.1343 23.8023
temp: 298.150 k
press: 1.00000 atm
elementType: 8 8 7 6 6 6 6 6 6 6 6 6 6 6 6 6 6 1 1 1 1 1 1 1 1 1 1 1 1 1 1 1
symmnumber: 1
zpe: 674805.6 jmol-1
zpe.correction: 0.257020 hartree
zpe.thermalcorrener: 0.272055 hartree
zpe.thermalcorrenthalpy: 0.273000 hartree
zpe.thermalcorrgfe: 0.213761 hartree
zpe.sumelectzpe: -746.480515 hartree
zpe.sumelectthermal: -746.465479 hartree
zpe.sumelectthermalent: -746.464535 hartree
zpe.sumelectthermalfe: -746.523774 hartree
dipole: 0.1513 0.9513 -0.6912
dipole: 1.1856
quadrupole: -77.6580 -97.9803 -99.0836
quadrupole: 5.8257 -0.0255 0.3841
quadrupole: 13.9160 -6.4063 -7.5097 5.8257 -0.0255 0.3841
hfenergy: -746.7375348 hartree
pointgroup: C01 [X(C14H15N1O2)]
dipole: 0.0673155 -0.3227149 0.3300009 debye
polarizability: 241.5057194|16.4605518|167.4212057|16.7747021|-12.8921798|99.7223542 unknown
InChI: InChI=1S/C14H15NO2/c1-3-17-14(16)9-11-8-10(2)12-6-4-5-7-13(12)15-11/h4-8H,3,9H2,1-2H3
charge 0 multiplicity 1
32 atoms
O  -3.687473 0.818143 0.038751
O  -3.062935 -1.429285 0.033002
N  0.443207 1.04104 -0.816565
C  2.250256 -0.420664 0.089007
C  1.335866 -1.540875 0.106136
C  -0.381349 -0.023664 -0.792605
C  1.752322 0.855747 -0.382925
C  0.028367 -1.322982 -0.338731
C  -1.797131 0.217221 -1.315727
C  3.615763 -0.510227 0.513312
C  1.777992 -2.906804 0.588684
C  2.628152 1.986941 -0.412085
C  4.451752 0.609917 0.474866
C  3.955094 1.867794 0.009256
C  -2.886278 -0.250201 -0.358869
C  -4.819632 0.497744 0.967396
C  -6.061709 0.076702 0.177433
H  -0.708256 -2.132108 -0.332379
H  -1.911312 1.289687 -1.526508
H  -1.932887 -0.347498 -2.259519
H  4.008265 -1.467788 0.872016
H  2.136719 -2.868483 1.634655
H  0.946601 -3.628838 0.541595
H  2.60928 -3.302638 -0.025183
H  2.216985 2.93445 -0.773625
H  5.494048 0.527913 0.802696
H  4.620539 2.737783 -0.015524
H  -4.491244 -0.298934 1.65764
H  -4.975419 1.440263 1.515712
H  -6.91181 -0.069301 0.869509
H  -6.343194 0.85186 -0.555977
H  -5.884676 -0.873216 -0.354345
