program: Gaussian 09
title: 000282808
version: EM64L-G09RevD.01
frameworkgroup: C1[X(C10H21NO2)]
method: RPBEPBE
basis: SDD
operation: Freq
keyword: #p
keyword: freq=noraman
keyword: PBEPBE/SDD
title: #p freq=noraman PBEPBE/SDD
converged: YES YES NO NO
title: Mulliken charges:
elementType: O O N C C C C C C C C C C H H H H H H H H H H H H H H H H H H H H H
charge: -0.295450 -0.266566 -0.032120 0.168872 -0.700460 -0.692123 -0.701962 0.242574 -0.393256 -0.299600 -0.317679 -0.708874 -0.656066 0.216743 0.209732 0.237376 0.199735 0.226042 0.223909 0.236139 0.211283 0.212651 0.237432 0.260352 0.201447 0.211240 0.216165 0.209351 0.266298 0.216184 0.212188 0.211133 0.225494 0.211814
chargesum: 0.00000
title: Mulliken charges with hydrogens summed into heavy atoms:
elementType: O O N C C C C C C C C C C
charge: -0.295450 -0.266566 -0.032120 0.168872 -0.036609 -0.042438 -0.041888 0.242574 0.104528 0.113088 0.107837 -0.014204 -0.007625
polarizability: 1.48068346e+02 2.93076779e+00 1.21345726e+02 -6.80052211e-01 8.46555148e-01 1.04930083e+02
1716.lowfreq: -13.2662 -9.6375 -5.6610 -0.0006 0.0002 0.0007 25.3686 35.6956 43.6760
frequency: 23.9101 35.4375 43.3292 70.6510 71.5538 91.6061 144.4922 160.4648 180.1100 193.1955 222.9262 242.5492 254.4530 263.6657 269.9452 292.7109 304.0747 344.3092 347.1683 367.2983 423.7065 457.6965 482.3375 548.4532 580.6294 634.6090 720.3990 742.0483 750.9973 789.8016 807.7465 850.2340 902.7666 930.3509 935.1089 951.2981 1013.8668 1021.1691 1024.1720 1030.3277 1076.1435 1079.6968 1085.8642 1121.1438 1122.1772 1173.2569 1208.9453 1230.5596 1243.3988 1262.4715 1267.3868 1304.3045 1321.6850 1334.5758 1363.3899 1367.3061 1375.5764 1384.9754 1387.4169 1399.4781 1401.5937 1451.0227 1454.1627 1464.3278 1464.3630 1469.6323 1471.4279 1472.6995 1475.1923 1476.8710 1487.4044 1491.4217 1498.1670 1504.7779 1595.8809 2920.2897 2934.5641 2978.3070 2979.8866 2985.2047 2986.5018 2987.6022 3033.7881 3039.7768 3067.4717 3070.4196 3073.8121 3079.4972 3082.3328 3085.0330 3092.2356 3092.6172 3096.6102 3096.6926 3098.4174 3152.5287
redmass: 3.0950 3.1512 4.4255 3.1984 2.2940 2.5447 2.1512 3.3442 1.0466 1.4057 1.3922 1.3135 1.0888 2.6135 1.9716 1.7958 2.5870 2.8893 3.0215 2.3918 2.4428 3.1434 2.1366 3.8258 4.2770 7.8105 6.8060 3.5296 2.9505 1.2004 1.1997 2.4941 2.0250 1.7153 1.5742 1.2036 2.1738 1.4452 1.4775 1.8441 2.2999 3.0148 1.8144 1.9679 1.9035 1.6185 2.9245 2.8460 1.6968 2.4046 1.1712 1.5192 1.2183 1.4872 1.3726 1.1850 1.2002 1.2832 1.2242 1.3604 1.3746 1.0506 1.1090 1.0490 1.0526 1.0471 1.0604 1.0515 1.0676 1.0574 1.0823 1.0725 1.0676 1.0792 9.0489 1.0700 1.0695 1.0347 1.0352 1.0358 1.0356 1.0359 1.0899 1.0928 1.0576 1.0999 1.0996 1.0982 1.0984 1.0995 1.1004 1.1008 1.0999 1.1012 1.0993 1.1129
irintensity: 0.4876 0.4283 0.7288 0.1006 0.5358 0.6950 12.2037 1.9584 0.2826 1.3324 0.5204 7.0846 1.3544 7.6285 4.2391 1.0333 2.5261 1.6282 4.6667 2.0294 2.1680 42.8958 2.9309 11.0548 26.5603 362.2442 2.8181 2.8776 1.8858 7.0314 15.1187 13.3898 1.3364 2.6331 3.8605 0.0996 20.5687 10.9413 27.1651 19.8394 16.0531 337.8920 19.3978 45.2458 28.7719 38.3807 5.8323 16.4247 38.4211 3.7160 3.6386 38.2284 5.6492 11.2988 8.5156 16.8339 18.9676 25.8069 19.4889 32.7619 17.0590 0.1303 17.6212 8.0462 0.2646 0.8154 7.5049 12.1912 2.7366 14.0728 14.9106 14.9323 34.0591 4.9448 174.0330 41.8973 62.3262 37.1307 19.5086 31.1761 34.3261 29.1655 26.6851 13.0234 23.8011 17.2434 28.3167 45.2415 34.7579 56.8085 2.5827 48.5766 33.3873 16.4721 48.9922 5.2874
temp: 298.150 k
press: 1.00000 atm
elementType: 8 8 7 6 6 6 6 6 6 6 6 6 6 1 1 1 1 1 1 1 1 1 1 1 1 1 1 1 1 1 1 1 1 1
symmnumber: 1
zpe: 782021.9 jmol-1
zpe.correction: 0.297856 hartree
zpe.thermalcorrener: 0.314928 hartree
zpe.thermalcorrenthalpy: 0.315872 hartree
zpe.thermalcorrgfe: 0.252276 hartree
zpe.sumelectzpe: -597.779345 hartree
zpe.sumelectthermal: -597.762274 hartree
zpe.sumelectthermalent: -597.761329 hartree
zpe.sumelectthermalfe: -597.824926 hartree
dipole: -1.3618 -1.9657 0.7652
dipole: 2.5108
quadrupole: -76.8010 -85.2422 -79.4545
quadrupole: -1.7155 -0.1095 1.3637
quadrupole: 3.6982 -4.7430 1.0448 -1.7155 -0.1095 1.3637
hfenergy: -598.0772017 hartree
pointgroup: C01 [X(C10H21N1O2)]
dipole: 0.5675927 0.6532468 0.4763154 debye
polarizability: 148.2564624|1.2750773|120.6291301|1.6996566|2.9134448|105.4585627 unknown
InChI: InChI=1S/C10H21NO2/c1-6-11(7-2)8-13-9(12)10(3,4)5/h6-8H2,1-5H3
charge 0 multiplicity 1
34 atoms
O  -0.251261 0.760385 -0.436142
O  -1.137994 -1.374914 -0.726568
N  2.138672 0.02978 -0.139982
C  -2.511325 0.390284 0.372123
C  -3.036115 1.589994 -0.468958
C  -3.592309 -0.71128 0.467987
C  -2.118023 0.885261 1.794281
C  -1.254169 -0.189365 -0.316423
C  1.130946 0.287691 -1.087315
C  2.08527 -1.248471 0.621016
C  2.670111 1.191713 0.619462
C  2.035274 -2.500988 -0.272393
C  4.205004 1.162347 0.765809
H  -3.319191 1.26789 -1.487993
H  -3.933212 2.018682 0.01558
H  -2.268449 2.377581 -0.553125
H  -4.493823 -0.306476 0.964217
H  -3.875187 -1.080348 -0.532964
H  -3.228436 -1.57714 1.048068
H  -1.34406 1.669357 1.737746
H  -3.008802 1.301353 2.30042
H  -1.731244 0.054289 2.413071
H  1.357798 1.170291 -1.702108
H  0.873539 -0.596923 -1.686116
H  2.995093 -1.285397 1.247076
H  1.214355 -1.252043 1.31596
H  2.368251 2.11016 0.083787
H  2.194203 1.246516 1.623779
H  1.071865 -2.575911 -0.804757
H  2.861758 -2.490785 -1.005327
H  2.137727 -3.405829 0.35431
H  4.54846 0.265495 1.312327
H  4.688363 1.161636 -0.226664
H  4.553005 2.049166 1.327514
