program: Gaussian 09
title: 000282803
version: EM64L-G09RevD.01
frameworkgroup: C1[X(C16H26)]
method: RPBEPBE
basis: SDD
operation: Freq
keyword: #p
keyword: freq=noraman
keyword: PBEPBE/SDD
title: #p freq=noraman PBEPBE/SDD
converged: YES YES NO NO
title: Mulliken charges:
elementType: C C C C C C C C C C C C C C C C H H H H H H H H H H H H H H H H H H H H H H H H H H
charge: -0.230629 -0.074622 -0.156799 -0.156297 -0.127556 0.010930 -0.490379 -0.462420 -0.482711 -0.468988 -0.501257 -0.472737 -0.409057 -0.417832 -0.383430 -0.402371 0.227732 0.203848 0.209038 0.214956 0.207726 0.207236 0.195748 0.204204 0.194073 0.196791 0.200129 0.204971 0.193871 0.196769 0.202894 0.207618 0.195679 0.192237 0.194599 0.198816 0.198434 0.199713 0.194526 0.187965 0.199707 0.196875
chargesum: 0.00000
title: Mulliken charges with hydrogens summed into heavy atoms:
elementType: C C C C C C C C C C C C C C C C
charge: -0.002896 0.129227 0.052239 0.058658 0.080170 0.218165 -0.090426 -0.071555 -0.077611 -0.078348 -0.090745 -0.084821 -0.015642 -0.019686 -0.000939 -0.005789
polarizability: 1.79765519e+02 7.07190361e-01 1.63395463e+02 2.84681397e-01 2.72757025e-01 1.28995776e+02
1716.lowfreq: -19.2935 -5.3742 -0.0008 -0.0006 -0.0005 15.2935 64.8635 96.2957 121.7727
frequency: 64.6689 96.2609 121.7639 132.9663 187.0221 213.0525 249.0441 267.1114 277.6586 318.1456 331.2059 359.9378 370.7117 402.3576 439.2530 446.6890 453.7521 507.6083 548.5133 582.2468 604.8650 613.5351 685.9146 745.2357 775.6105 792.0388 826.1804 832.8382 847.4311 854.5204 866.9787 872.9284 888.1056 894.5759 909.1430 937.9169 945.4736 975.7040 991.3488 1002.6559 1030.1981 1043.8161 1053.6553 1059.4887 1062.6787 1069.3016 1081.7419 1090.3360 1099.5255 1107.4457 1122.3019 1129.9479 1134.5462 1142.9348 1164.9798 1183.1096 1190.1027 1204.4074 1224.7466 1227.6916 1236.3492 1238.6934 1257.9294 1266.7421 1280.1164 1282.0466 1288.7112 1296.2166 1299.6497 1309.8957 1311.6604 1317.9986 1323.9103 1327.7249 1332.3107 1333.2479 1336.6388 1340.7093 1342.7643 1346.4932 1348.3252 1360.0076 1362.5764 1376.1541 1457.0519 1461.3130 1465.2402 1465.8170 1467.9485 1471.1767 1475.5935 1476.2001 1480.9893 1481.8920 2936.9314 2945.0590 2947.9196 2951.5415 2955.7535 2959.3027 2960.6602 2961.4714 2963.3930 2965.2899 2967.3372 2970.3583 2971.1802 2976.5753 2979.5212 2981.5881 3008.1504 3010.0450 3012.1769 3015.8667 3017.8613 3023.9776 3028.0425 3030.8737 3035.8031 3043.4652
redmass: 2.5780 3.0218 2.7699 2.3199 2.3655 2.0898 2.5651 2.7923 2.4247 2.7151 1.8302 2.3329 2.0950 3.0613 3.0744 2.7123 2.9985 2.8308 2.3536 2.9783 2.1555 2.2323 3.2678 2.2515 1.7227 1.8832 1.5468 2.4977 2.1709 2.5785 2.3480 1.9646 2.2225 1.6831 1.7084 2.2862 2.1208 2.2041 1.7317 2.0748 1.9503 1.7879 1.7533 1.5862 1.7858 1.6448 1.6792 1.3662 1.9185 1.4074 2.0644 1.7726 2.4406 1.7096 1.5375 1.6975 1.5900 1.4901 1.3985 1.4260 1.3690 1.3313 1.3161 1.4039 1.3812 1.3319 1.2799 1.3048 1.2938 1.4358 1.3625 1.3989 1.3539 1.3798 1.4171 1.4103 1.3971 1.4655 1.4546 1.4910 1.5529 1.4559 1.4725 1.3720 1.0863 1.0872 1.0839 1.0867 1.0817 1.0889 1.0840 1.0844 1.0907 1.0906 1.0784 1.0712 1.0729 1.0719 1.0721 1.0659 1.0641 1.0619 1.0647 1.0712 1.0679 1.0661 1.0656 1.0791 1.0666 1.0814 1.1002 1.0982 1.0970 1.0981 1.0985 1.0983 1.0993 1.1023 1.1033 1.1027
irintensity: 0.0204 0.0005 0.0296 0.0597 0.0088 0.0580 0.0553 0.0397 0.0438 0.0712 0.1664 0.2383 0.5224 0.0069 0.1249 0.1458 0.0613 0.6612 1.9301 0.9576 2.9413 0.5110 0.5860 1.6601 1.9877 3.3166 13.4741 1.0721 7.3366 0.6775 0.3002 0.9603 1.1716 1.4778 4.7623 2.5736 3.5252 0.1970 0.3071 0.4232 2.0995 0.7913 0.2710 1.2932 1.0640 0.5953 0.4211 1.7060 1.9391 0.1009 1.9355 0.5878 0.5877 0.7922 0.3661 0.8735 2.1775 1.3754 0.9807 0.2983 2.3918 0.3244 0.3108 0.3122 1.8518 2.2935 0.8157 1.4979 3.9823 0.7900 0.7718 0.2747 0.9439 0.1237 0.5241 0.3514 0.5789 0.5894 0.3663 0.3719 0.7448 0.7766 0.1667 0.3497 3.2172 4.6270 12.1779 5.1908 8.6318 6.7875 15.1409 7.4257 10.4128 8.7202 6.2095 4.5842 0.2143 72.1261 4.3882 20.2402 45.1097 38.3582 35.7753 4.9049 40.1315 52.0711 34.3803 10.6969 53.0258 134.3135 37.6606 36.8083 53.8846 66.8775 27.2170 68.1396 85.4428 64.4611 109.8853 134.2098
temp: 298.150 k
press: 1.00000 atm
elementType: 6 6 6 6 6 6 6 6 6 6 6 6 6 6 6 6 1 1 1 1 1 1 1 1 1 1 1 1 1 1 1 1 1 1 1 1 1 1 1 1 1 1
symmnumber: 1
zpe: 1013812.2 jmol-1
zpe.correction: 0.386141 hartree
zpe.thermalcorrener: 0.399802 hartree
zpe.thermalcorrenthalpy: 0.400746 hartree
zpe.thermalcorrgfe: 0.347090 hartree
zpe.sumelectzpe: -624.044659 hartree
zpe.sumelectthermal: -624.030998 hartree
zpe.sumelectthermalent: -624.030054 hartree
zpe.sumelectthermalfe: -624.083710 hartree
dipole: 0.0209 -0.0426 0.0146
dipole: 0.0497
quadrupole: -101.4661 -100.8771 -98.8494
quadrupole: -0.0794 -0.0732 -0.1622
quadrupole: -1.0686 -0.4796 1.5481 -0.0794 -0.0732 -0.1622
hfenergy: -624.4307997 hartree
pointgroup: C01 [X(C16H26)]
dipole: -0.0084219 0.0167019 0.0056715 debye
polarizability: 179.7504207|0.8795801|163.4110492|-0.05571|-0.3300347|128.9952883 unknown
InChI: InChI=1S/C16H26/c1-2-8-13-12(7-1)14-9-3-5-11-6-4-10-15(13)16(11)14/h11-16H,1-10H2
charge 0 multiplicity 1
42 atoms
C  0.901762 0.071306 -0.717048
C  0.245296 1.451364 -0.330718
C  -0.262136 -0.963502 -0.624929
C  -1.13034 1.09754 0.344059
C  -1.06628 -0.445592 0.606304
C  2.07927 -0.263451 0.237156
C  1.191539 2.32079 0.539145
C  0.210373 -2.438252 -0.606706
C  -2.324137 1.493205 -0.569576
C  -2.438122 -1.107922 0.883682
C  3.204929 0.789602 0.072455
C  2.565027 -1.715788 0.044267
C  2.64107 2.247253 -0.001522
C  1.411601 -2.704781 0.333178
C  -3.666191 0.877747 -0.114596
C  -3.558986 -0.663922 -0.085378
H  1.312141 0.102158 -1.748264
H  0.045588 2.019723 -1.262825
H  -0.906591 -0.836205 -1.520716
H  -1.24299 1.639892 1.305768
H  -0.43859 -0.611519 1.507057
H  1.706751 -0.194765 1.281434
H  1.169545 1.977382 1.593274
H  0.835388 3.369631 0.546476
H  0.513693 -2.718576 -1.637138
H  -0.636011 -3.104479 -0.344011
H  -2.120297 1.157058 -1.60753
H  -2.39352 2.598713 -0.611235
H  -2.753586 -0.842977 1.914557
H  -2.331264 -2.211377 0.868278
H  3.783905 0.561695 -0.84572
H  3.913213 0.694715 0.919366
H  3.427864 -1.920394 0.710004
H  2.923345 -1.854692 -0.998489
H  3.298087 2.941926 0.55565
H  2.636622 2.596825 -1.05344
H  1.75445 -3.75062 0.208847
H  1.10018 -2.596129 1.392419
H  -4.482215 1.198561 -0.791459
H  -3.924925 1.246522 0.90026
H  -4.521111 -1.11559 0.226183
H  -3.350747 -1.033276 -1.110519
