program: Gaussian 09
title: 000282799
version: EM64L-G09RevD.01
frameworkgroup: C1[X(C10H7F3INO3)]
method: RPBEPBE
basis: SDD
operation: Freq
keyword: #p
keyword: freq=noraman
keyword: PBEPBE/SDD
title: #p freq=noraman PBEPBE/SDD
converged: YES YES NO NO
title: Mulliken charges:
elementType: I F F F O O O N C C C C C C C C C C H H H H H H H
charge: 0.139378 -0.173073 -0.141461 -0.127341 -0.176972 -0.437496 -0.239415 -0.479080 0.397496 0.503987 -0.497146 -0.546117 0.274742 -0.315687 -0.816859 0.140562 0.111487 0.301791 0.286225 0.294334 0.352844 0.229370 0.234874 0.292045 0.391513
chargesum: 0.00000
title: Mulliken charges with hydrogens summed into heavy atoms:
elementType: I F F F O O O N C C C C C C C C C C
charge: 0.139378 -0.173073 -0.141461 -0.127341 -0.176972 -0.045983 -0.239415 -0.126236 0.397496 0.503987 -0.210921 -0.546117 0.274742 -0.021353 -0.060570 0.140562 0.111487 0.301791
polarizability: 2.13091476e+02 -1.01686479e+01 1.83644499e+02 8.33906795e-01 1.24887975e+00 7.40194694e+01
1716.lowfreq: -5.1256 -0.0007 0.0002 0.0006 5.9067 8.9742 17.0534 32.7206 43.5838
frequency: 16.8578 32.7119 43.5660 58.3678 70.2710 108.9119 126.9237 133.3520 174.3821 186.5307 196.0666 225.3211 232.8414 238.1082 278.4452 312.4467 347.2970 379.3548 390.6535 412.0163 443.8013 498.6896 504.0344 518.3902 532.1926 559.6955 598.8410 611.5154 636.3376 661.8725 701.9279 721.4331 735.7309 743.9993 797.0904 857.9972 923.7516 927.7137 933.4683 1003.5228 1009.9743 1037.8838 1042.7216 1053.1630 1083.4807 1123.9496 1176.2889 1215.7936 1240.3059 1281.3890 1320.4102 1369.2924 1396.3505 1401.8728 1448.5598 1460.5146 1481.8537 1501.2524 1565.5796 1603.9272 1642.7492 1658.2470 2986.4473 3069.3538 3096.7641 3173.0266 3178.0007 3458.8938 3533.8200
redmass: 18.0291 9.7946 12.3542 10.4270 13.1828 10.3859 5.5767 7.9310 4.5076 1.9538 2.9698 2.7060 8.5364 8.3827 9.4589 4.8965 5.3867 12.2892 7.1672 6.7652 12.9905 8.7197 4.2510 3.2265 5.8548 3.4182 5.4798 1.3896 7.2209 1.4071 8.2017 6.8626 7.1762 3.8189 6.1134 8.3552 2.0758 2.1231 1.7218 1.7682 6.3430 4.3697 6.0090 1.5691 6.0766 1.8458 2.4683 3.0401 1.9786 1.9523 3.3060 9.0432 3.2330 1.2395 2.7177 1.1594 1.1854 1.9959 5.1725 6.5360 9.0564 8.8741 1.0368 1.0972 1.0998 1.0922 1.0933 1.0763 1.0643
irintensity: 0.1886 0.2260 0.8001 1.3356 1.9528 0.8074 1.2148 1.1472 2.0285 1.9533 1.9968 1.9902 1.3760 1.8502 6.8088 1.6904 1.0231 4.0580 25.3557 0.3732 5.7306 7.0634 3.0001 26.9985 7.2518 39.1687 36.8394 94.2644 41.7349 85.0467 16.6711 7.0306 45.5136 45.2822 42.2037 55.5190 3.3706 4.3214 21.8890 17.4696 178.4888 252.4868 284.0666 13.4744 91.4549 180.2972 60.7506 32.1996 17.6723 4.2996 175.9034 42.4621 26.2998 17.9051 38.0544 27.3626 17.2496 273.3717 26.8273 13.5716 346.6354 167.5284 12.9354 6.2344 13.7629 0.0142 3.3158 67.8926 60.2826
temp: 298.150 k
press: 1.00000 atm
elementType: 53 9 9 9 8 8 8 7 6 6 6 6 6 6 6 6 6 6 1 1 1 1 1 1 1
symmnumber: 1
zpe: 415632.3 jmol-1
zpe.correction: 0.158306 hartree
zpe.thermalcorrener: 0.175839 hartree
zpe.thermalcorrenthalpy: 0.176783 hartree
zpe.thermalcorrgfe: 0.109447 hartree
zpe.sumelectzpe: -975.433536 hartree
zpe.sumelectthermal: -975.416004 hartree
zpe.sumelectthermalent: -975.415060 hartree
zpe.sumelectthermalfe: -975.482395 hartree
dipole: 2.1578 -0.8113 -2.3096
dipole: 3.2632
quadrupole: -124.6185 -111.0846 -120.8033
quadrupole: -16.3784 3.2608 4.0090
quadrupole: -5.7830 7.7509 -1.9679 -16.3784 3.2608 4.0090
hfenergy: -975.5918425 hartree
pointgroup: C01 [X(C10H7F3I1N1O3)]
dipole: -0.8718655 0.4642795 -0.8200732 debye
dipolederiv: -0.0789406 0.1846325 0.0422074 0.1593942 -0.3611697 -0.0493329 0.0444325 -0.058202 0.0242105 -0.5572491 0.0376982 0.0807312 0.045318 -0.4879323 -0.2627028 0.0696356 -0.2505878 -0.585303 -0.627578 -0.2208863 0.0937692 -0.2161682 -0.6230933 0.1492581 0.1279702 0.1725495 -0.3268204 -0.6558182 0.0910576 -0.2508876 0.119669 -0.3013372 0.1563255 -0.2137145 0.127315 -0.5437874 -0.4880905 0.0237106 0.0907703 -0.3092618 -0.4656912 -0.2636086 -0.4553576 -0.3177971 -0.7376486 -0.7600551 0.4672531 0.0750008 0.6318296 -0.9824979 -0.1178648 0.1157982 -0.1160878 -0.4402527 -1.0810356 -0.2416955 0.0319736 -0.2361204 -0.756617 -0.0340846 0.0533523 -0.0247123 -0.3307027 -1.2589898 -0.2933334 -0.2806748 -0.2478694 -0.4355037 -0.0554129 -0.3064967 -0.1622582 -0.5478222 -0.096049 0.1632734 -0.028261 0.2745463 0.2442651 -0.0359541 0.1003869 0.0228778 -0.0157191 0.7409196 0.3855027 0.1054478 -0.0961584 -0.1687263 -0.1027133 -0.1044187 -0.1105616 0.0356676 0.1244957 -0.2394055 -0.0279683 0.1293795 -0.0990697 0.0080236 0.008133 0.0538404 -0.1073435 0.025141 -0.6640108 -0.1372318 -0.4713213 0.8205546 0.1868609 -0.1221836 0.2049544 -0.1397502 -0.7998045 0.0960862 0.060517 -0.0911773 0.1210271 0.0153705 0.0780784 -0.0042696 0.0196826 -0.0684387 0.2204889 0.0319916 0.0662537 -0.336309 -0.0422635 -0.0099858 -0.0704042 -0.0696699 -0.0501673 -0.1094824 -0.0027457 -0.0822614 -0.1306169 -0.0242165 -0.0323766 -0.0945954 0.0062309 0.9959639 0.175177 0.1589213 0.6693269 0.4419793 0.5145475 0.721299 0.5625423 0.9622912 2.1711333 -0.1582271 -0.1715987 -0.2226418 1.3225053 0.1472023 -0.2349422 0.1422484 0.2708723 1.720729 0.1196513 0.135052 0.016911 1.4072638 -0.0873855 0.096933 -0.0995807 1.3993259 0.1149702 0.0262949 0.0030513 0.0517097 0.0110197 -0.0160798 -0.0053718 -0.0090783 0.1496325 0.1277599 -0.0594866 -0.0075732 -0.0239703 0.0621538 -0.0083734 0.0084807 -0.0072425 0.1572129 0.2344643 0.0337281 -0.0397218 -0.0112143 0.3060374 -0.0802653 0.0247104 -0.0235513 0.2889546 -0.0078713 -0.0353448 0.1074374 -0.0078017 0.0568423 -0.0464156 0.1042378 0.0292635 0.0021697 -0.0115311 0.1411949 -0.0292155 0.0555615 -0.040515 0.0315052 -0.0111834 0.0534156 0.1150187 0.0841707 -0.0606458 -0.0557612 -0.0361024 0.091973 0.0140466 -0.0564175 -0.0172073 0.0120617 0.2018708 -0.083231 0.0147686 -0.1678306 0.3034579 0.0035333 -0.0009995 -0.0028707 0.4014887 unknown
polarizability: 213.4793647|-8.6995439|179.6289634|-4.9880952|19.4070794|77.6471166 unknown
InChI: InChI=1S/C10H7F3INO3/c1-4-2-5(8(16)17)3-6(14)7(4)15-9(18)10(11,12)13/h2-3,15-16H,1H3
charge 0 multiplicity 1
25 atoms
I  0.166717 -3.184529 -0.708936
F  3.882629 -0.791532 -1.148517
F  4.36604 1.352687 -0.560783
F  4.589712 -0.315605 0.958744
O  2.102622 1.042538 1.435422
O  -4.850859 1.240479 0.335264
O  -5.04631 -1.062007 0.081746
N  1.393731 -0.153409 -0.481192
C  -0.683866 1.174487 -0.138404
C  -0.024823 -0.082881 -0.316294
C  -2.089228 1.174437 0.017729
C  -0.794177 -1.281519 -0.392487
C  -2.839524 -0.021576 -0.03091
C  -2.1894 -1.26105 -0.253609
C  0.069127 2.487276 -0.16198
C  2.322191 0.396506 0.382825
C  -4.320713 -0.04045 0.1262
C  3.790618 0.15836 -0.08455
H  -2.614864 2.122342 0.160941
H  -2.788971 -2.173841 -0.299796
H  1.750795 -0.801349 -1.194633
H  0.852391 2.494694 -0.941767
H  -0.62231 3.322716 -0.359609
H  0.576588 2.669506 0.80252
H  -5.837915 1.170216 0.435177
