program: Gaussian 09
title: 000282791
version: EM64L-G09RevD.01
frameworkgroup: C1[X(C9H10N4O5)]
method: RPBEPBE
basis: SDD
operation: Freq
keyword: #p
keyword: freq=noraman
keyword: PBEPBE/SDD
title: #p freq=noraman PBEPBE/SDD
converged: YES YES NO NO
title: Mulliken charges:
elementType: O O O O O N N N N C C C C C C C C C H H H H H H H H H H
charge: -0.282521 -0.441355 -0.452524 -0.216119 -0.242943 -0.423221 -0.382977 0.012865 -0.417957 -0.195266 -0.154030 -0.163098 -0.386050 0.314771 0.065365 -0.070528 0.154916 0.127791 0.275691 0.255031 0.276481 0.266258 0.230766 0.362182 0.368802 0.376364 0.373977 0.367327
chargesum: 0.00000
title: Mulliken charges with hydrogens summed into heavy atoms:
elementType: O O O O O N N N N C C C C C C C C C
charge: -0.282521 -0.072552 -0.076160 -0.216119 -0.242943 -0.061039 -0.009000 0.012865 -0.050630 0.080425 0.101001 0.113382 0.110975 0.314771 0.065365 -0.070528 0.154916 0.127791
polarizability: 1.84487612e+02 4.49668942e+00 1.51962152e+02 8.79229949e+00 -2.27860663e+00 8.03576811e+01
1716.lowfreq: -16.4874 -7.6266 -4.0772 -0.0011 -0.0003 -0.0003 21.2737 29.2497 64.0161
frequency: 21.1585 27.5125 64.0072 92.5468 122.2726 150.4997 167.8471 177.0469 256.2305 260.0922 291.2257 327.0783 349.2567 364.5569 382.1788 402.6762 418.9466 468.0913 494.4162 542.4547 586.8982 596.1213 605.6422 651.6510 660.7341 668.7577 675.9718 685.7785 711.9106 726.2094 756.2420 782.0512 800.7814 820.8417 847.6684 856.3542 871.2654 939.4072 961.0808 980.3322 1026.5351 1039.4563 1040.3032 1088.7876 1099.1056 1157.8153 1160.8867 1197.9006 1219.0003 1230.3455 1244.7491 1246.4593 1268.6810 1298.8365 1309.1974 1321.2894 1338.9353 1354.2644 1361.4093 1369.4906 1384.2667 1413.8201 1449.6563 1465.8328 1502.2940 1637.0163 1661.7687 1672.2910 2989.6575 3007.2409 3050.7952 3105.9418 3108.0405 3426.8625 3526.5839 3528.2914 3543.5373 3586.2294
redmass: 5.6255 6.1035 8.3447 7.0571 8.1651 6.2536 8.3145 6.2186 8.1284 6.1501 10.2364 6.2702 10.5633 4.8815 1.5590 1.5116 7.0969 10.2809 7.1570 5.1642 3.6070 1.4125 4.1933 4.4579 5.1916 1.8736 2.0774 2.1063 1.8712 3.7829 2.5495 3.2394 5.4494 4.2000 4.4239 6.6901 2.5875 4.0806 3.7800 3.2804 2.4005 4.3407 4.0102 2.2527 6.0456 1.1224 3.6499 1.3488 1.5308 1.5248 1.9525 5.1042 1.5189 1.5285 6.1499 1.3475 1.3984 1.8322 1.2617 1.5417 1.1989 2.3283 4.5020 1.0904 5.5779 8.4464 10.2488 5.1940 1.0664 1.0854 1.0869 1.0901 1.0993 1.0643 1.0767 1.0657 1.0785 1.0825
irintensity: 3.5711 1.6862 1.2896 1.0020 0.7614 10.0999 7.5603 3.5059 7.0771 18.5142 2.3560 3.2235 26.5860 8.5112 51.3502 23.1619 1.7700 7.1825 9.1545 4.2321 36.4469 136.6502 1.8672 6.8034 8.8835 53.0307 96.0686 1.6885 14.6473 20.6860 107.9008 96.9712 10.8527 58.1739 21.0006 8.0712 6.2867 55.0936 8.8767 58.4304 11.0104 30.1636 89.5269 49.6216 80.5783 33.9961 21.5215 44.8979 8.5347 4.1309 38.1238 88.6344 25.5932 19.3653 160.6212 3.8864 13.3717 6.8616 25.5834 9.1762 59.0499 8.9008 52.1352 8.9293 2.8481 4.5531 436.4187 736.2903 29.5461 14.8050 21.5502 16.9485 12.7684 56.4466 73.2156 13.4806 106.2885 117.7500
temp: 298.150 k
press: 1.00000 atm
elementType: 8 8 8 8 8 7 7 7 7 6 6 6 6 6 6 6 6 6 1 1 1 1 1 1 1 1 1 1
symmnumber: 1
zpe: 538315.8 jmol-1
zpe.correction: 0.205034 hartree
zpe.thermalcorrener: 0.220174 hartree
zpe.thermalcorrenthalpy: 0.221118 hartree
zpe.thermalcorrgfe: 0.161099 hartree
zpe.sumelectzpe: -942.754332 hartree
zpe.sumelectthermal: -942.739192 hartree
zpe.sumelectthermalent: -942.738248 hartree
zpe.sumelectthermalfe: -942.798266 hartree
dipole: -7.2420 1.6386 0.2568
dipole: 7.4295
quadrupole: -124.1981 -120.4236 -98.0067
quadrupole: -0.1536 -1.5781 3.9113
quadrupole: -9.9887 -6.2141 16.2028 -0.1536 -1.5781 3.9113
hfenergy: -942.9593656 hartree
pointgroup: C01 [X(C9H10N4O5)]
dipole: 2.9033551 0.3282401 -0.0812314 debye
polarizability: 183.2729645|-9.6974006|148.0843097|4.5259487|19.2645222|85.4501715 unknown
InChI: InChI=1S/C9H10N4O5/c14-2-1-18-7(6(2)15)4-3-5(13-12-4)8(16)11-9(17)10-3/h2,6-7,10-12,14-15H,1H2
charge 0 multiplicity 1
28 atoms
O  1.871932 0.983146 0.643216
O  3.530126 -2.071598 -0.327139
O  4.701659 0.332486 0.123376
O  -4.395361 -0.868276 -0.608071
O  -2.530664 3.096589 1.052907
N  -0.189989 -2.006865 -0.388382
N  -1.060166 1.31916 0.647472
N  -1.552025 -2.060375 -0.598943
N  -3.377139 1.070153 0.219999
C  1.710368 -0.495532 0.443241
C  2.737752 -0.912115 -0.677749
C  3.600134 0.378164 -0.857086
C  2.598002 1.49227 -0.558476
C  0.275456 -0.782946 0.100011
C  -0.877252 0.007675 0.214567
C  -1.970255 -0.806402 -0.227389
C  -3.342907 -0.2832 -0.247333
C  -2.326922 1.913514 0.669546
H  2.005473 -0.968106 1.399002
H  2.213561 -1.158929 -1.616886
H  4.080042 0.443038 -1.844359
H  3.058165 2.451552 -0.276109
H  1.897598 1.641214 -1.404406
H  0.3630 -2.844299 -0.571687
H  4.352139 -1.725263 0.124095
H  4.369568 0.685038 0.991357
H  -0.25557 1.866567 0.962269
H  -4.304427 1.507237 0.237757
