program: Gaussian 09
title: 000282795
version: EM64L-G09RevD.01
frameworkgroup: C1[X(C12H11NO2)]
method: RPBEPBE
basis: SDD
operation: Freq
keyword: #p
keyword: freq=noraman
keyword: PBEPBE/SDD
title: #p freq=noraman PBEPBE/SDD
converged: YES YES NO NO
title: Mulliken charges:
elementType: O O N C C C C C C C C C C C C H H H H H H H H H H H
charge: -0.270917 -0.415191 -0.049103 -0.639330 0.463991 0.302587 -0.357692 -0.397825 -0.384302 0.316065 -0.358190 -0.226789 -0.229021 -0.239318 -0.322639 0.239795 0.240418 0.270364 0.236933 0.239687 0.271502 0.227859 0.227973 0.230040 0.253898 0.369205
chargesum: 0.00000
title: Mulliken charges with hydrogens summed into heavy atoms:
elementType: O O N C C C C C C C C C C C C
charge: -0.270917 -0.045986 -0.049103 -0.159117 0.463991 0.302587 -0.087328 -0.160892 -0.144616 0.316065 -0.086688 0.001071 -0.001048 -0.009278 -0.068741
polarizability: 2.52378358e+02 -1.14904944e+01 1.06147092e+02 -5.36138792e+00 -1.38210359e+00 1.00716139e+02
1716.lowfreq: -17.4569 -9.0830 -0.0006 -0.0002 0.0002 2.8360 5.3368 23.2798 51.6347
frequency: -6.7883 22.6830 51.6201 84.8534 113.2111 141.6710 212.7207 220.4635 241.0320 320.2235 355.1292 385.6139 402.8557 425.0051 448.7606 475.6718 593.7113 599.2528 617.5735 643.9751 677.3221 705.3707 773.5489 780.1466 812.7048 816.3316 853.8143 880.3650 894.9807 921.1620 929.4826 937.4094 941.6112 953.7968 975.6842 990.6023 995.3378 1020.8250 1026.9905 1082.2234 1154.7959 1167.9737 1170.2383 1173.7375 1188.1074 1205.7552 1214.4351 1223.5991 1312.2730 1326.2930 1353.9134 1377.9093 1382.8186 1439.8276 1461.8715 1485.6880 1543.6433 1566.4229 1595.1997 1599.2471 1615.5445 2976.1898 3021.4604 3086.7784 3120.0971 3121.1154 3135.2280 3147.0914 3164.4765 3228.1524 3245.7933 3569.9245
redmass: 4.1431 4.5371 5.6537 4.1690 5.9256 5.9438 4.6264 4.4695 6.3961 2.0983 4.7410 6.7471 2.8071 1.1136 5.6278 3.8603 5.2943 4.2607 6.3944 4.3924 3.9466 1.5893 2.2785 4.5087 1.2462 3.8091 1.2490 1.3678 8.2206 1.5850 1.8265 4.1499 1.4265 5.6773 1.3898 6.1694 1.3195 1.3083 2.1463 1.5765 3.4144 1.1383 2.4741 1.0593 1.1270 1.8560 1.7278 1.4108 2.3077 1.2831 2.7868 1.6585 8.4508 2.1745 1.1336 2.3343 6.5168 5.9217 6.1224 7.3164 6.1700 1.0592 1.1001 1.0896 1.0856 1.0883 1.0915 1.0961 1.1016 1.0939 1.1040 1.0675
irintensity: 0.0252 0.1648 0.0718 1.6045 0.1408 0.6679 1.7685 2.4806 6.4933 0.9790 5.6330 1.3218 0.0187 173.8685 2.4311 13.0732 2.5316 0.0516 0.1992 1.9624 15.0697 67.5675 54.9815 53.9176 55.0064 3.3886 0.1520 0.2998 179.1874 19.3418 4.4550 9.8554 23.6453 5.2626 0.0157 0.5373 0.3622 27.7575 12.4185 10.8885 1.9640 0.2885 1.6393 0.1703 1.2349 47.0176 37.5968 3.5167 2.6478 0.2868 0.5555 54.1261 0.0856 7.8535 19.7951 19.1118 55.8684 41.7680 1.2502 1.1104 6.1907 22.9397 8.3486 6.6367 8.3684 2.3248 13.7224 39.5812 22.8181 4.6351 0.3433 95.7156
temp: 298.150 k
press: 1.00000 atm
elementType: 8 8 7 6 6 6 6 6 6 6 6 6 6 6 6 1 1 1 1 1 1 1 1 1 1 1
symmnumber: 1
zpe: 524570.5 jmol-1
zpe.correction: 0.199798 hartree
zpe.thermalcorrener: 0.212240 hartree
zpe.thermalcorrenthalpy: 0.213184 hartree
zpe.thermalcorrgfe: 0.159470 hartree
zpe.sumelectzpe: -667.936736 hartree
zpe.sumelectthermal: -667.924294 hartree
zpe.sumelectthermalent: -667.923350 hartree
zpe.sumelectthermalfe: -667.977064 hartree
dipole: 1.8521 -0.6469 -0.1820
dipole: 1.9702
quadrupole: -78.5692 -85.1206 -84.2218
quadrupole: 1.6132 0.0453 -0.8990
quadrupole: 4.0680 -2.4834 -1.5846 1.6132 0.0453 -0.8990
hfenergy: -668.136534 hartree
pointgroup: C01 [X(C12H11N1O2)]
dipole: -0.7114874 -0.0303903 -0.3061137 debye
dipolederiv: -0.3082861 -0.0043805 -0.0679675 -0.0107231 -0.1209444 0.006587 0.0462815 0.0092817 -0.5816934 -1.6064553 -0.0639387 -0.1546564 -0.0491322 -0.3973227 -0.013858 -0.8617798 -0.0532158 -0.1385702 0.7532408 0.0524198 0.0002148 0.0331421 -0.1819825 -0.0026262 0.8660408 0.0456781 -0.0748709 0.0279626 -0.0048711 -0.0600427 -0.0364604 0.1660629 -0.0019654 0.1446278 0.0074571 0.085676 0.3601128 0.0120436 0.1107862 0.0068724 -0.0179191 0.0069476 0.2164264 0.0097129 -0.0377773 0.2559936 0.0128104 0.0047668 0.0540704 -0.0269306 -0.0122324 -0.5689286 -0.0331282 0.3743694 -0.3302269 -0.0093742 0.0618257 -0.0211143 -0.1690282 0.0039541 0.4307792 0.0220524 -0.1497109 -0.1525435 -0.0634431 0.038972 -0.0546553 0.0514504 -0.0446697 0.0181018 -0.0333721 -0.1239742 -0.1530331 0.0607981 0.0342484 0.0669079 0.0485706 0.0344261 0.0145871 0.0232635 -0.1276206 -0.2478889 -0.0138817 -0.0174258 -0.0060201 0.0147356 -0.0056432 -0.4937159 -0.0302396 0.2383704 0.2826306 0.0269125 -0.057097 0.0285368 -0.1716091 -0.0060908 0.0078615 -0.0032144 -0.057354 -0.0531414 0.0668723 0.0633083 0.0802284 0.087978 0.0354592 0.0617354 0.0323057 -0.100821 -0.0507052 -0.0603188 0.0650314 -0.0742087 0.0866496 -0.0445993 0.0703977 -0.0431756 -0.0977572 0.0080601 0.0012836 0.1272024 -0.000167 -0.0767177 -0.0005847 0.11012 -0.0018032 -0.0887214 0.5540532 0.0306891 0.103928 0.0242127 -0.0321485 0.0014952 0.370485 0.015755 0.1600732 -0.057161 -0.0039039 0.0140959 0.0274982 -0.0161443 -0.1271251 0.0264771 -0.0614738 -0.005427 -0.058164 -0.0078839 0.0184373 -0.0283428 -0.0402912 0.1298285 0.0306484 0.0614216 0.0131318 0.0355268 -0.0048847 -0.0763684 -0.0090105 0.1592256 -0.0008575 -0.1154532 -0.0037465 0.0761577 0.0848385 0.0897131 -0.0623004 0.0891254 -0.0445904 0.042742 -0.0592672 0.0577266 0.0998527 0.0859705 -0.0909242 -0.0568202 -0.0989172 -0.0460388 -0.0346055 -0.056804 -0.0466727 0.10257 0.0674236 -0.0075417 0.0631838 -0.0075137 0.1889049 0.0069648 0.0659562 0.0065772 0.0407304 0.0490558 -0.0781465 -0.0524018 -0.098531 -0.0737695 -0.0431182 -0.0678758 -0.0405833 0.1233527 0.0516667 0.0718803 -0.0545791 0.0928951 -0.0706309 0.052734 -0.070577 0.0498137 0.1184909 -0.0630535 -0.0028056 -0.1271339 -0.0021625 0.0874806 0.0010766 -0.1414845 0.000723 0.0814593 0.0598617 -0.0082925 0.0025848 -0.0077915 0.2052503 0.0055465 -0.0348922 0.0035835 -0.0438251 0.4042618 -0.0008317 0.0782074 0.0012609 0.3897595 0.0102146 -0.0097478 0.0052732 0.1138886 unknown
polarizability: 249.93874|8.8401819|102.3726339|21.0531902|-1.5462099|106.9302151 unknown
InChI: InChI=1S/C12H11NO2/c14-13-9-12-7-6-11(15-12)8-10-4-2-1-3-5-10/h1-7,9,14H,8H2
charge 0 multiplicity 1
26 atoms
O  1.567922 0.068434 1.09698
O  6.187728 0.341136 0.452332
N  4.929765 0.286703 -0.298345
C  -0.888706 -0.079531 1.338186
C  -2.193255 -0.088471 0.550378
C  0.31841 0.01238 0.445334
C  0.516215 0.051819 -0.930416
C  -2.816212 -1.311212 0.196711
C  -2.794555 1.127795 0.138567
C  2.561226 0.144998 0.083054
C  1.935514 0.136161 -1.162916
C  -4.018179 -1.320569 -0.547712
C  -3.995914 1.123363 -0.605433
C  -4.611991 -0.102279 -0.950823
C  3.923939 0.211729 0.556049
H  -0.872828 0.772456 2.046539
H  -0.808753 -0.995245 1.956601
H  -0.271276 0.023963 -1.680072
H  -2.360062 -2.258987 0.508025
H  -2.320901 2.08069 0.405029
H  2.446873 0.18493 -2.121496
H  -4.490418 -2.274198 -0.809099
H  -4.451539 2.071765 -0.911549
H  -5.545223 -0.10742 -1.525011
H  4.084523 0.197271 1.645158
H  6.8654 0.393816 -0.269572
