program: Gaussian 09
title: 000282779
version: EM64L-G09RevD.01
frameworkgroup: C1[X(C15H17NO)]
method: RPBEPBE
basis: SDD
operation: Freq
keyword: #p
keyword: freq=noraman
keyword: PBEPBE/SDD
title: #p freq=noraman PBEPBE/SDD
converged: YES YES NO NO
title: Mulliken charges:
elementType: O N C C C C C C C C C C C C C C C H H H H H H H H H H H H H H H H H
charge: -0.254634 -0.469920 0.199845 0.160419 0.207194 0.208808 -0.257059 -0.350665 -0.368717 -0.786906 -0.501923 -0.356102 -0.333989 -0.275295 -0.215339 0.163971 -0.692683 0.307753 0.255116 0.223303 0.231888 0.260434 0.260459 0.218267 0.221368 0.221861 0.217869 0.215517 0.210631 0.224023 0.225423 0.220087 0.204438 0.204556
chargesum: 0.00000
title: Mulliken charges with hydrogens summed into heavy atoms:
elementType: O N C C C C C C C C C C C C C C C
charge: -0.254634 -0.162167 0.199845 0.160419 0.207194 0.208808 -0.001943 -0.127362 -0.136830 -0.047746 -0.058694 0.077284 -0.123358 -0.051272 0.010084 0.163971 -0.063602
polarizability: 2.96625725e+02 -7.81585035e+00 2.04033588e+02 6.66491035e-01 2.14116655e-01 8.75243343e+01
1716.lowfreq: -62.6009 -8.5749 -1.5903 -0.0001 0.0003 0.0007 5.4282 23.1941 26.2652
frequency: -62.5732 22.4454 26.1466 48.6430 63.6823 75.7869 127.0173 136.8133 160.4881 190.5190 221.2095 228.1095 247.0940 284.8271 300.3048 342.5161 384.1749 412.5299 436.7623 482.9532 542.8972 559.0777 565.6423 565.9469 579.0712 653.6433 664.1517 673.1891 730.4963 750.7618 753.6433 766.8707 834.9360 854.7409 856.1566 879.2754 881.2106 917.9664 933.7627 962.2127 974.4523 1001.5180 1006.6319 1030.3825 1035.1221 1048.9623 1078.9052 1080.2866 1100.8072 1137.8609 1150.3799 1178.7748 1212.8685 1237.6427 1245.1816 1266.4891 1279.8890 1295.6391 1308.2492 1326.7077 1352.8609 1362.2114 1386.5174 1403.5790 1414.9043 1432.2732 1441.7556 1460.1080 1467.1392 1468.1460 1477.6324 1481.3023 1483.3083 1488.5584 1537.2255 1552.7815 1588.3371 1631.9347 1644.4624 2947.2965 2967.8801 2986.3404 2991.0340 3002.3196 3042.3235 3068.5533 3069.7789 3072.4256 3081.5607 3085.4986 3128.0435 3138.6145 3144.1386 3158.6976 3175.5953 3595.9886
redmass: 1.0271 2.1738 2.5094 4.1136 3.9467 3.7640 3.2675 4.2900 3.2122 4.5784 3.0517 1.0761 4.1948 3.6477 4.0382 3.8824 3.3578 3.9076 2.9644 5.5283 2.3322 3.6902 1.1862 6.4646 3.3378 5.6114 3.5508 5.6832 1.2168 1.3681 4.2541 3.5385 1.4959 4.4757 1.5299 2.3587 1.7427 2.8104 1.3978 2.6821 1.3124 1.1667 1.9705 2.1591 1.4740 2.1728 2.7657 1.5562 2.3119 2.1383 1.5347 1.2469 1.3718 1.4137 1.8082 1.7149 1.0915 2.3178 1.4603 1.8466 1.7963 2.3877 1.2180 1.7777 2.0677 1.1012 2.7343 1.0435 3.4178 1.0850 1.0432 2.1218 1.0703 1.6704 5.0251 7.7980 6.1976 7.0470 5.9808 1.0600 1.0358 1.0371 1.0971 1.0613 1.0999 1.0980 1.0987 1.1020 1.0907 1.0960 1.0857 1.0902 1.0912 1.0959 1.0964 1.0804
irintensity: 0.4285 2.7879 0.8627 0.9528 2.3835 0.5193 4.7095 1.4341 0.1885 1.6475 0.0136 0.0729 8.6689 4.0331 1.0008 1.1260 2.5936 0.7988 5.7775 0.1117 0.3669 2.9679 79.3236 25.3348 4.7822 4.9297 11.7297 5.0118 18.4762 83.8234 9.5356 1.2224 15.6006 8.8376 0.1092 23.0259 14.3239 1.5648 2.7748 22.4775 0.3718 34.3884 14.4233 8.3095 3.8679 27.3948 54.7586 1.1322 1.7829 92.5180 21.1731 4.4470 0.4312 6.6825 10.4875 70.4820 1.1908 99.3896 153.5652 80.7541 33.0855 101.2959 6.2281 10.1860 28.9594 17.4034 9.0397 16.5864 77.1234 9.4115 12.1709 3.9585 15.0199 41.1281 10.8796 471.1903 8.8973 0.2612 319.6962 29.9123 46.4289 25.6196 12.2120 17.6226 0.6376 7.8835 59.6798 83.2414 10.0891 11.3422 0.6658 16.3851 16.1807 25.6853 18.5743 78.4802
temp: 298.150 k
press: 1.00000 atm
elementType: 8 7 6 6 6 6 6 6 6 6 6 6 6 6 6 6 6 1 1 1 1 1 1 1 1 1 1 1 1 1 1 1 1 1
symmnumber: 1
zpe: 734779.6 jmol-1
zpe.correction: 0.279863 hartree
zpe.thermalcorrener: 0.296035 hartree
zpe.thermalcorrenthalpy: 0.296979 hartree
zpe.thermalcorrgfe: 0.233957 hartree
zpe.sumelectzpe: -710.550689 hartree
zpe.sumelectthermal: -710.534517 hartree
zpe.sumelectthermalent: -710.533573 hartree
zpe.sumelectthermalfe: -710.596594 hartree
dipole: 5.2110 0.0201 0.0885
dipole: 5.2117
quadrupole: -89.3363 -91.1765 -106.1083
quadrupole: 18.5329 -0.0126 0.2933
quadrupole: 6.2040 4.3639 -10.5679 18.5329 -0.0126 0.2933
hfenergy: -710.8305513 hartree
pointgroup: C01 [X(C15H17N1O1)]
dipole: -2.0501049 -0.033315 0.0186406 debye
polarizability: 296.8004618|-6.7031136|203.8102766|0.7605158|2.346529|87.572909 unknown
InChI: InChI=1S/C15H17NO/c1-3-6-12(17)9-10-13-11(2)16-15-8-5-4-7-14(13)15/h4-5,7-10,16H,3,6H2,1-2H3
charge 0 multiplicity 1
34 atoms
O  3.294059 -1.643158 0.027576
N  -3.134561 -1.40333 0.039734
C  -0.932219 -0.792542 0.050283
C  -1.754361 0.421438 0.070869
C  -3.129669 0.00263 0.063747
C  -1.83052 -1.889341 0.031258
C  0.499495 -0.971857 0.048249
C  -1.47986 1.813451 0.09197
C  -4.211759 0.90462 0.077927
C  -1.546592 -3.365151 0.00719
C  3.946786 0.718918 0.126783
C  5.414682 0.256531 0.109064
C  1.49882 -0.024445 0.078137
C  -2.554146 2.727676 0.106047
C  -3.905762 2.281865 0.099545
C  2.924548 -0.424849 0.071874
C  6.403751 1.437065 0.208153
H  -3.96933 -1.986981 0.030075
H  0.861082 -2.012022 0.020301
H  -0.453133 2.188484 0.096248
H  -5.251216 0.558034 0.072122
H  -0.958187 -3.646887 -0.884603
H  -0.963532 -3.677008 0.892461
H  -2.478988 -3.956508 -0.005595
H  3.741906 1.319762 1.039321
H  3.745689 1.405049 -0.724238
H  5.578264 -0.452535 0.941912
H  5.599349 -0.323239 -0.814593
H  1.282887 1.048784 0.111299
H  -2.346081 3.803108 0.122033
H  -4.71836 3.016347 0.110927
H  7.451035 1.083475 0.194299
H  6.275796 2.141677 -0.636073
H  6.253524 2.007041 1.145101
