program: Gaussian 09
title: 000282857
version: EM64L-G09RevD.01
frameworkgroup: C1[X(C18H18BrNO2)]
method: RPBEPBE
basis: SDD
operation: Freq
keyword: #p
keyword: freq=noraman
keyword: PBEPBE/SDD
title: #p freq=noraman PBEPBE/SDD
converged: YES YES NO NO
title: Mulliken charges:
elementType: Br O O N C C C C C C C C C C C C C C C C C C H H H H H H H H H H H H H H H H H H
charge: 0.003796 -0.292300 -0.289923 -0.464685 -0.710692 0.517079 0.513353 -0.469194 -0.359830 0.459637 -0.368540 -0.446857 -0.443291 -0.368266 0.396098 -0.176809 -0.181047 -0.225677 -0.826896 -0.459901 0.214204 -0.503556 0.228668 0.232056 0.236006 0.245418 0.270418 0.229579 0.239993 0.251786 0.304360 0.250341 0.250541 0.216659 0.317919 0.240399 0.271353 0.235573 0.236111 0.226118
chargesum: 0.00000
title: Mulliken charges with hydrogens summed into heavy atoms:
elementType: Br O O N C C C C C C C C C C C C C C C C C C
charge: 0.003796 -0.292300 -0.289923 -0.160325 -0.249969 0.517079 0.513353 -0.233188 -0.114412 0.459637 -0.098122 -0.217278 -0.203298 -0.116481 0.396098 0.073532 0.069493 -0.225677 -0.051919 -0.188548 0.214204 0.194247
polarizability: 3.77855856e+02 3.02235463e+01 1.96646964e+02 1.00751255e+01 6.42813371e+00 1.74337932e+02
1716.lowfreq: -4.2491 -0.0007 -0.0006 -0.0004 1.4237 3.0622 9.2029 19.6219 28.2903
frequency: 9.0146 19.5229 28.2597 38.5502 48.5086 62.0977 72.2118 87.4656 98.9985 104.7623 126.0506 138.8314 173.9287 189.8256 213.6839 247.4301 260.7143 298.7218 303.1195 312.4134 325.7656 345.0282 371.3108 407.3398 408.2911 415.2820 483.0868 498.5380 521.2668 533.5508 572.9359 600.3995 621.5790 628.3990 644.7242 689.1611 698.2903 709.3823 712.7955 775.3470 800.3538 817.5665 826.7908 831.8899 835.1971 848.2138 866.8719 876.2113 902.7259 932.1138 955.9893 968.5801 971.6121 974.2976 995.8960 1006.2351 1019.2775 1034.5785 1054.4983 1060.3682 1107.3569 1109.9988 1111.9622 1128.2087 1147.9263 1186.6552 1188.1685 1194.1237 1198.5390 1223.3818 1237.3856 1282.8880 1286.1318 1304.2134 1334.0721 1352.6811 1372.9828 1384.3002 1393.9390 1400.7472 1417.8168 1426.2764 1449.8741 1452.4464 1459.9432 1465.7295 1473.2947 1492.7796 1505.2490 1514.5363 1580.2514 1592.6647 1597.1011 1606.3029 1625.4046 1645.3753 2971.0889 2971.4726 2996.0136 3016.8852 3049.0408 3092.9296 3114.3288 3121.7215 3124.4923 3126.6533 3135.6244 3137.5595 3141.4459 3166.7798 3170.0851 3175.7064 3187.5525 3519.9832
redmass: 7.3171 5.0737 4.4586 4.6005 5.9398 3.6875 1.2814 2.4244 1.6696 2.8260 2.9396 4.3229 5.4498 5.1803 4.9256 5.7987 5.5140 4.7954 4.8487 4.0679 3.6440 2.5322 5.2222 3.0494 3.0415 4.0638 3.1355 3.0595 3.5721 2.0563 1.4715 5.5821 5.5064 5.7928 5.6244 5.2258 5.2977 3.6601 4.0304 2.8495 2.9559 1.6868 2.5671 1.5495 1.2552 1.9510 4.6607 1.5270 5.9076 1.5546 1.3569 1.5604 1.3526 1.4083 5.0727 2.9232 3.1362 1.9406 1.5083 2.5916 1.6380 1.8462 1.3301 1.4227 1.4638 1.1387 1.2725 1.3389 1.7226 2.0731 3.5943 1.4468 1.7210 1.4982 1.8861 1.6948 6.0884 3.8684 2.4787 1.3079 2.0698 1.4377 1.0504 1.1301 1.1724 1.0530 2.1307 1.0525 2.0479 2.4301 7.0064 4.8569 6.0655 8.0710 5.9288 4.8996 1.0599 1.0395 1.0298 1.1001 1.0970 1.1039 1.0878 1.0973 1.0901 1.0898 1.0896 1.1040 1.0961 1.0949 1.0960 1.0935 1.0900 1.0754
irintensity: 0.2899 0.2201 0.0617 0.2240 1.0105 0.7651 2.3206 1.6743 3.1183 0.1237 2.2199 2.9260 1.2523 0.5817 2.1247 5.8314 0.8784 0.1236 7.6045 14.8949 1.4955 2.9640 1.7896 1.0009 2.2909 5.6568 23.8899 22.7795 16.6473 58.0730 64.4159 7.4482 4.5847 1.6236 7.0727 3.2186 4.7499 3.5802 2.5564 22.5740 34.2409 52.6891 18.1192 5.9085 1.5056 49.2340 13.6087 3.1250 21.6432 11.4964 0.0521 3.1690 0.2612 0.6064 71.2727 2.6242 130.3345 57.9532 3.4685 27.5241 98.1967 299.7117 44.9351 16.7570 8.3237 0.2862 8.6950 8.5844 3.0200 6.7899 35.2054 1.0013 10.0926 4.7982 69.0243 37.2246 2.1980 56.0991 12.5481 51.0641 10.0000 27.9309 11.8198 218.3650 26.6821 12.5865 84.0843 21.2558 9.7710 523.8934 5.1948 28.8618 4.3619 451.6939 38.1489 460.0562 29.8688 39.4609 59.4483 10.9076 17.4064 33.1564 17.4631 4.7265 15.7238 11.0266 8.4952 20.9001 13.6349 10.3061 0.3837 7.9559 2.3758 25.9599
temp: 298.150 k
press: 1.00000 atm
elementType: 35 8 8 7 6 6 6 6 6 6 6 6 6 6 6 6 6 6 6 6 6 6 1 1 1 1 1 1 1 1 1 1 1 1 1 1 1 1 1 1
symmnumber: 1
zpe: 824501.7 jmol-1
zpe.correction: 0.314036 hartree
zpe.thermalcorrener: 0.335915 hartree
zpe.thermalcorrenthalpy: 0.336859 hartree
zpe.thermalcorrgfe: 0.257837 hartree
zpe.sumelectzpe: -913.796431 hartree
zpe.sumelectthermal: -913.774552 hartree
zpe.sumelectthermalent: -913.773608 hartree
zpe.sumelectthermalfe: -913.852630 hartree
dipole: -0.5989 -2.7315 0.3054
dipole: 2.8130
quadrupole: -171.7605 -128.2410 -130.0972
quadrupole: 4.6472 -1.7656 5.6813
quadrupole: -28.3943 15.1253 13.2690 4.6472 -1.7656 5.6813
hfenergy: -914.1104671 hartree
pointgroup: C01 [X(C18H18Br1N1O2)]
dipole: 0.3087947 1.0623382 0.0303795 debye
polarizability: 374.3754837|17.1850676|193.0134214|-37.833287|-9.0013831|181.4518463 unknown
InChI: InChI=1S/C18H18BrNO2/c1-13(11-18(21)22-2)20-17-9-5-15(6-10-17)12-14-3-7-16(19)8-4-14/h3-11,20H,12H2,1-2H3
charge 0 multiplicity 1
40 atoms
Br 7.15734 -1.951817 -1.768065
O  -4.920784 -2.017134 1.528277
O  -6.401352 -0.754695 0.236157
N  -2.642081 1.332879 -1.000335
C  2.67777 1.24869 1.345366
C  1.279084 1.222424 0.732252
C  3.746493 0.484624 0.565935
C  0.136879 0.977888 1.532622
C  1.074345 1.489823 -0.646347
C  -1.359853 1.246378 -0.388329
C  -1.167492 0.993588 0.994977
C  -0.218714 1.497678 -1.200293
C  5.002855 1.077351 0.289243
C  3.52124 -0.847358 0.131794
C  -3.856369 0.71498 -0.683372
C  6.017113 0.369289 -0.397209
C  4.519628 -1.573469 -0.553202
C  5.76018 -0.952513 -0.809588
C  -5.022931 1.285636 -1.468769
C  -3.967097 -0.317045 0.232923
C  -5.212315 -0.980848 0.604899
C  -6.091752 -2.789212 1.989695
H  3.009388 2.300635 1.456742
H  2.61695 0.839954 2.373754
H  0.262422 0.781825 2.604694
H  1.938229 1.677464 -1.294527
H  -2.025069 0.843842 1.654941
H  -0.350347 1.68928 -2.272886
H  5.200525 2.106935 0.611415
H  2.552445 -1.322284 0.324494
H  -2.671994 1.920165 -1.837326
H  6.982186 0.840308 -0.604936
H  4.334536 -2.600816 -0.880144
H  -4.805087 1.271393 -2.554996
H  -5.936443 0.706392 -1.27632
H  -5.20792 2.336466 -1.174965
H  -3.077027 -0.732103 0.709055
H  -6.589542 -3.286164 1.139111
H  -6.821071 -2.128321 2.489296
H  -5.682173 -3.528608 2.693269
