program: Gaussian 09
title: 000282783
version: EM64L-G09RevD.01
frameworkgroup: C1[X(C15H18O3)]
method: RPBEPBE
basis: SDD
operation: Freq
keyword: #pfreq=noraman
keyword: PBEPBE/SDD
title: #p freq=noraman PBEPBE/SDD
converged: YES YES NO NO
title: Mulliken charges:
elementType: O O O C C C C C C C C C C C C C C C H H H H H H H H H H H H H H H H H H
charge: -0.218849 -0.204918 -0.237041 -0.082650 -0.281116 -0.491381 -0.181021 -0.506951 0.358404 0.449153 -0.359590 -0.736363 0.086127 -0.277697 -0.702313 -0.306330 0.185048 -0.786170 0.254235 0.258921 0.232278 0.228202 0.221132 0.247505 0.230814 0.223768 0.224844 0.218433 0.241595 0.261767 0.236058 0.261517 0.227825 0.256507 0.234543 0.233714
chargesum: 0.00000
title: Mulliken charges with hydrogens summed into heavy atoms:
elementType: O O O C C C C C C C C C C C C C C C
charge: -0.218849 -0.204918 -0.237041 0.171584 -0.022196 -0.030901 0.040111 -0.028631 0.358404 0.449153 -0.135822 -0.051492 0.086127 -0.015929 -0.204738 -0.078505 0.185048 -0.061405
polarizability: 2.64838176e+02 1.36177820e+01 1.69173255e+02 -7.64959707e+00 7.12096371e+00 1.09809497e+02
1716.lowfreq: -13.6088 -6.9694 -4.7409 0.0006 0.0006 0.0009 28.9598 41.2679 49.4240
frequency: 28.9529 41.1691 49.4194 66.5771 86.1414 92.9886 127.0137 146.7378 156.1976 172.4693 195.1251 244.6755 248.7239 269.9919 276.5517 289.9682 306.2789 326.8737 385.9379 416.4957 436.3595 481.4232 494.3780 543.7662 566.6886 590.0612 607.2454 617.5779 651.8515 661.9352 699.1301 737.3599 772.1177 788.1533 811.7606 828.3000 864.7926 882.9628 906.5460 915.6914 927.2130 947.9696 953.7954 986.3416 988.3275 1002.6500 1005.6462 1017.4331 1027.0744 1042.6847 1089.3345 1100.4857 1120.5756 1131.9594 1180.3223 1189.1748 1192.6755 1209.8890 1222.6537 1259.8015 1274.3841 1292.6579 1297.0497 1305.9114 1315.7599 1318.2086 1334.6983 1345.4846 1366.6173 1372.3324 1381.6605 1395.7971 1418.9451 1442.1646 1454.0692 1455.1133 1472.8455 1480.1819 1487.8243 1562.0439 1624.7964 1647.3960 1672.7021 1685.1459 2955.2910 2962.3101 2977.7651 2978.9439 3008.0139 3013.7658 3023.7863 3037.1928 3059.7559 3064.4687 3074.1963 3075.4302 3079.7138 3095.9843 3096.1182 3115.5888 3125.5325 3205.3723
redmass: 4.1956 5.1355 4.5550 3.7462 1.1353 4.4291 4.0596 2.8481 3.9832 4.2654 5.1941 1.1922 2.5865 3.6303 2.6002 2.7016 3.2831 2.4797 4.2527 3.2429 4.5511 3.8907 3.1817 2.6759 4.9163 3.5911 2.8950 3.6533 2.2700 3.2065 3.2812 3.5306 2.6067 2.7854 2.5200 1.5827 1.9957 2.5371 3.1613 2.9332 1.9336 1.9004 1.8527 2.3600 1.4014 1.6071 1.3213 1.6075 1.7535 4.1288 2.1640 2.3557 2.4898 2.9341 1.4062 1.6357 1.7241 1.8547 1.2270 2.2798 1.2864 1.3734 1.4953 1.6626 1.4169 1.4006 1.3742 1.3859 1.2621 1.6094 1.5089 1.2661 1.1720 1.0937 1.0908 1.0503 1.0507 1.0780 1.0622 7.0807 6.6833 5.9471 6.7941 11.2405 1.0821 1.0655 1.0376 1.0356 1.0613 1.0850 1.0901 1.0903 1.0964 1.1014 1.0918 1.0966 1.0993 1.0801 1.0703 1.0910 1.0991 1.1155
irintensity: 0.3420 9.0406 3.1234 0.7254 0.0624 0.7458 1.7632 0.1758 1.6450 0.4161 0.8988 0.3534 0.6012 5.4634 1.3786 0.4845 4.2173 2.0394 0.9076 3.3490 1.1951 0.6849 1.2311 1.4486 24.1735 8.0564 5.6108 6.2819 10.0870 3.7219 0.4323 0.5847 1.7951 9.9574 13.8261 17.9515 2.7924 19.9539 25.2867 82.0011 2.5434 14.4145 35.9498 13.5387 54.6753 20.9895 37.0347 23.8395 1.7487 150.5747 1.1443 4.4010 12.4442 16.5166 26.6671 51.4289 2.0695 72.7235 6.4430 42.8955 4.9185 18.7082 59.3829 61.2691 5.6386 21.4813 0.7683 16.4645 56.4289 27.5781 20.5961 15.6783 20.9361 34.1048 16.1653 20.2516 19.7423 6.0244 19.4463 343.3218 83.2818 18.7054 41.1474 274.8732 17.6970 10.9351 3.6751 22.1231 22.9504 7.7389 22.3630 17.8336 14.5764 28.5704 4.9602 37.4271 32.3015 11.7778 14.5131 10.9439 21.4820 2.8869
temp: 298.150 k
press: 1.00000 atm
elementType: 8 8 8 6 6 6 6 6 6 6 6 6 6 6 6 6 6 6 1 1 1 1 1 1 1 1 1 1 1 1 1 1 1 1 1 1
symmnumber: 1
zpe: 770008.8 jmol-1
zpe.correction: 0.293281 hartree
zpe.thermalcorrener: 0.311226 hartree
zpe.thermalcorrenthalpy: 0.312170 hartree
zpe.thermalcorrgfe: 0.246395 hartree
zpe.sumelectzpe: -806.681247 hartree
zpe.sumelectthermal: -806.663302 hartree
zpe.sumelectthermalent: -806.662358 hartree
zpe.sumelectthermalfe: -806.728132 hartree
dipole: -2.0370 3.5548 2.4623
dipole: 4.7800
quadrupole: -155.6108 -97.4396 -106.6782
quadrupole: -6.9808 5.8960 -0.1862
quadrupole: -35.7013 22.4700 13.2313 -6.9808 5.8960 -0.1862
hfenergy: -806.9745274 hartree
pointgroup: C01 [X(C15H18O3)]
dipole: -0.7744471 -1.4311223 -0.942735 debye
polarizability: 264.7288254|-12.743893|169.3186565|10.5994993|5.3118617|109.7734451 unknown
InChI: InChI=1S/C15H18O3/c1-9-8-14-13(11(3)15(17)18-14)7-6-12(9)5-4-10(2)16/h4-6,9,13-14H,3,7-8H2,1-2H3
charge 0 multiplicity 1
36 atoms
O  3.346454 1.142571 0.402387
O  5.290929 -0.125484 0.63647
O  -5.485906 0.745709 0.099476
C  2.028959 0.98975 -0.317293
C  1.818757 -0.54909 -0.466476
C  0.981603 1.765862 0.480688
C  -0.464284 1.644579 -0.067165
C  0.950561 -1.168187 0.66826
C  3.246528 -1.072789 -0.416167
C  -1.159999 0.307265 0.231128
C  -0.533412 -0.863046 0.586638
C  -0.570613 2.007486 -1.576445
C  4.112994 -0.038851 0.246836
C  -2.633261 0.373181 0.16097
C  3.74178 -2.259127 -0.845113
C  -3.518101 -0.652374 -0.051714
C  -4.988656 -0.409963 -0.070149
C  -5.874172 -1.627993 -0.311474
H  2.182144 1.442545 -1.314384
H  1.335101 -0.776443 -1.432823
H  1.276175 2.8321 0.47678
H  1.010845 1.43438 1.53512
H  -1.055378 2.411516 0.477908
H  1.361504 -0.859636 1.65302
H  1.079945 -2.266356 0.631538
H  -1.184869 -1.704269 0.864744
H  -0.113814 2.994998 -1.773896
H  -0.067453 1.257973 -2.21394
H  -1.627289 2.052497 -1.894868
H  -3.091807 1.369666 0.272438
H  3.113461 -3.013042 -1.332661
H  4.80558 -2.486984 -0.711725
H  -3.174751 -1.678553 -0.237951
H  -6.934259 -1.332969 -0.30049
H  -5.633496 -2.094513 -1.286117
H  -5.698799 -2.395505 0.466649
