program: Gaussian 09
title: 000282773
version: EM64L-G09RevD.01
frameworkgroup: C1[X(C16H15N)]
method: RPBEPBE
basis: SDD
operation: Freq
keyword: #pfreq=noraman
keyword: PBEPBE/SDD
title: #p freq=noraman PBEPBE/SDD
converged: YES YES NO NO
title: Mulliken charges:
elementType: N C C C C C C C C C C C C C C C C H H H H H H H H H H H H H H H
charge: -0.483945 0.286835 0.341794 -0.548378 -0.542449 -0.412456 -0.410658 0.173896 0.222698 -0.584129 -0.563930 0.180814 0.223926 -0.401064 -0.376564 -0.257962 -0.217616 0.214399 0.221026 0.216472 0.220123 0.206042 0.203419 0.205233 0.204173 0.238569 0.235790 0.299845 0.232436 0.230108 0.220663 0.220892
chargesum: 0.00000
title: Mulliken charges with hydrogens summed into heavy atoms:
elementType: N C C C C C C C C C C C C C C C C
charge: -0.184099 0.286835 0.341794 -0.112954 -0.105854 -0.002996 -0.001252 0.173896 0.222698 -0.345560 -0.328139 0.180814 0.223926 -0.168628 -0.146456 -0.037300 0.003276
polarizability: 3.02585739e+02 7.46776424e+00 1.75364462e+02 2.95272482e-01 1.19056698e+00 8.60412186e+01
1716.lowfreq: -6.1936 -0.0006 -0.0002 0.0002 5.1584 11.0605 60.4432 87.4826 115.0984
frequency: 60.3743 87.4749 115.0802 147.7202 193.8998 221.3295 285.1755 306.5067 334.9725 346.3750 367.6152 425.2416 444.9872 446.4053 478.6552 481.3489 510.5137 561.1703 571.4278 604.2276 639.8981 647.9696 712.8504 715.2247 731.4630 751.6065 772.1741 792.3938 821.1863 851.7056 852.8308 860.0603 876.4457 890.0865 922.1034 932.5186 933.7022 952.3162 970.0581 997.3945 1016.9184 1082.5768 1091.0812 1106.2254 1131.3280 1141.8780 1160.5065 1165.7965 1184.1768 1206.8824 1231.0784 1237.5893 1248.3238 1254.9950 1275.0450 1301.2911 1320.0935 1336.6041 1341.5933 1343.4204 1355.9860 1396.4523 1414.5992 1443.8441 1454.1379 1458.7375 1468.3974 1469.5044 1474.8396 1481.9026 1486.4854 1583.4332 1589.5505 1625.0171 1647.3453 2951.7836 2952.4385 2976.7283 2977.4645 3014.7294 3016.7421 3038.3951 3046.5957 3115.1030 3118.2161 3123.9910 3131.9138 3145.1079 3163.3042 3613.3963
redmass: 3.8971 3.0148 2.8404 4.6418 3.5417 3.4297 3.0207 3.1618 3.8095 3.0196 3.5873 2.6518 3.1395 3.1805 2.4514 1.4097 3.6472 5.2029 3.6541 4.4652 4.1872 2.9715 4.8461 5.0924 2.6121 1.7209 2.9306 4.9107 1.4885 1.4540 4.2615 1.4800 2.6189 1.5019 1.4862 1.4024 2.5199 3.0832 1.3064 2.9361 1.9795 1.8419 1.6478 1.8789 1.2426 1.9365 1.3834 1.1414 1.7016 3.4935 1.4172 1.4539 1.3833 2.2930 1.2966 2.2983 1.5796 1.7175 1.7119 1.4130 1.8090 3.9673 4.1946 3.6075 1.3043 1.1001 1.8747 1.1711 1.1185 4.1558 3.6658 7.0881 6.5371 7.0507 7.9877 1.0648 1.0646 1.0640 1.0619 1.0934 1.0949 1.0985 1.1043 1.0912 1.0915 1.0849 1.0891 1.0951 1.1002 1.0801
irintensity: 1.1710 0.0514 1.6866 0.4887 0.6514 0.5440 0.5946 0.8076 0.8834 0.5961 0.6636 8.5681 0.6876 1.6089 26.3735 82.1870 2.7179 0.0804 2.9916 6.8897 1.5853 0.5197 0.7381 1.5033 29.7126 66.0986 14.4255 1.3864 10.1880 1.5706 2.4407 23.5902 0.8338 0.7700 21.3491 1.5748 2.0637 2.7419 0.0057 7.8321 6.3672 1.8373 0.0590 5.7226 0.7947 7.2689 1.3639 2.0655 4.5195 4.5495 4.9222 21.7338 34.4405 31.8263 1.4502 13.8671 3.3623 7.8400 42.1566 6.7099 16.4774 2.7064 21.2957 23.2270 1.8691 17.7334 40.1478 13.1801 2.8526 36.6722 28.7966 2.8540 2.1110 43.6921 15.0183 46.1057 20.5386 41.1085 34.7574 72.8610 4.6899 90.4185 70.4722 27.4721 0.5465 2.1707 3.1782 35.0068 37.8384 45.7747
temp: 298.150 k
press: 1.00000 atm
elementType: 7 6 6 6 6 6 6 6 6 6 6 6 6 6 6 6 6 1 1 1 1 1 1 1 1 1 1 1 1 1 1 1
symmnumber: 1
zpe: 696992.4 jmol-1
zpe.correction: 0.265470 hartree
zpe.thermalcorrener: 0.278221 hartree
zpe.thermalcorrenthalpy: 0.279166 hartree
zpe.thermalcorrgfe: 0.226719 hartree
zpe.sumelectzpe: -672.311281 hartree
zpe.sumelectthermal: -672.298530 hartree
zpe.sumelectthermalent: -672.297585 hartree
zpe.sumelectthermalfe: -672.350032 hartree
dipole: -0.8459 -1.6122 -0.0254
dipole: 1.8208
quadrupole: -90.5375 -84.6348 -105.9983
quadrupole: -3.5412 0.0012 0.4878
quadrupole: 3.1860 9.0887 -12.2747 -3.5412 0.0012 0.4878
hfenergy: -672.5767509 hartree
pointgroup: C01 [X(C16H15N1)]
dipole: -0.3369132 0.6321296 0.0094408 debye
polarizability: 302.6778187|-6.6389134|175.2741241|-0.2243941|1.1261608|86.0394768 unknown
InChI: InChI=1S/C16H15N/c1-2-6-12-10-16-14(9-11(12)5-1)13-7-3-4-8-15(13)17-16/h3-4,7-10,17H,1-2,5-6H2
charge 0 multiplicity 1
32 atoms
N  1.435717 1.774681 0.023725
C  -1.968763 -0.70456 -0.011944
C  -2.201699 0.710797 0.013219
C  -3.132461 -1.696369 -0.06955
C  -3.620803 1.278368 0.063818
C  -4.485101 -1.081641 0.352571
C  -4.702189 0.265403 -0.369633
C  0.454679 -0.312747 -0.003081
C  0.200135 1.101076 0.01618
C  -0.643261 -1.199373 -0.016484
C  -1.109821 1.612903 0.023919
C  1.904549 -0.484108 -0.006126
C  2.481253 0.835357 0.010573
C  2.759121 -1.610996 -0.022976
C  3.876601 1.041493 0.011833
C  4.156952 -1.413537 -0.022258
C  4.707141 -0.101048 -0.004889
H  -3.228832 -2.077018 -1.108714
H  -2.899348 -2.578047 0.558516
H  -3.837898 1.602158 1.104013
H  -3.677463 2.192077 -0.559367
H  -5.305371 -1.787079 0.120402
H  -4.49886 -0.913243 1.448379
H  -5.706601 0.672491 -0.146083
H  -4.651631 0.103154 -1.465179
H  -0.476393 -2.28378 -0.032961
H  -1.298275 2.693516 0.039916
H  1.554004 2.784607 0.038141
H  2.344235 -2.625154 -0.03653
H  4.308358 2.048422 0.024919
H  4.829524 -2.278065 -0.035239
H  5.795597 0.026462 -0.004712
