program: Gaussian 09
title: 000282775
version: EM64L-G09RevD.01
frameworkgroup: C1[X(C14H15NO)]
method: RPBEPBE
basis: SDD
operation: Freq
keyword: #p
keyword: freq=noraman
keyword: PBEPBE/SDD
title: #p freq=noraman PBEPBE/SDD
converged: YES YES NO NO
title: Mulliken charges:
elementType: O N C C C C C C C C C C C C C C H H H H H H H H H H H H H H H
charge: -0.261499 -0.214543 0.218614 0.164425 0.196441 0.204082 -0.363501 -0.348164 -0.662445 -0.796741 -0.252065 -0.226202 -0.273961 -0.320538 0.167529 -0.793079 0.237357 0.223439 0.244770 0.255035 0.245106 0.241208 0.262591 0.241635 0.239889 0.224554 0.224195 0.210403 0.230257 0.250804 0.230404
chargesum: 0.00000
title: Mulliken charges with hydrogens summed into heavy atoms:
elementType: O N C C C C C C C C C C C C C C
charge: -0.261499 -0.214543 0.218614 0.164425 0.196441 0.204082 -0.126144 -0.124725 0.082466 -0.051308 -0.012176 -0.001647 -0.049766 -0.110134 0.167529 -0.081614
polarizability: 2.78715213e+02 1.87348824e+00 1.99524440e+02 2.68100206e-02 -1.82090228e-03 7.84894974e+01
1716.lowfreq: -9.3736 -8.1969 -1.4429 -0.0005 0.0003 0.0004 34.7929 58.8599 71.7779
frequency: 34.7072 58.8488 71.7700 74.6488 77.7867 118.3608 133.8337 150.4145 180.3587 192.3379 229.3573 248.2479 276.3798 315.1373 318.9237 384.2428 415.8002 439.8169 486.1873 536.0956 555.3209 565.8768 579.8189 604.6957 635.3914 659.9355 708.4470 750.3577 767.2729 787.2863 838.5036 860.4762 868.6264 922.2816 932.3167 952.6016 973.9391 987.3091 1005.6747 1024.5342 1031.0659 1040.1722 1054.5888 1119.5528 1129.5135 1134.8258 1160.0608 1186.7262 1194.7346 1255.2379 1295.6053 1308.8878 1330.1401 1362.7333 1378.0816 1402.7411 1411.9962 1427.7177 1443.2543 1446.8999 1455.1112 1457.2050 1465.0283 1472.5692 1483.8210 1484.1047 1497.2314 1531.4000 1554.6306 1586.6150 1625.3025 1641.1595 2974.5499 2976.0874 2983.3573 3043.0788 3059.0575 3059.3778 3083.7993 3113.9804 3120.8506 3124.1141 3129.7417 3141.7925 3151.0830 3160.3608 3178.0161
redmass: 3.4461 2.5162 1.0781 4.2711 1.2858 3.0768 2.7080 2.5944 1.1798 6.8703 2.9563 3.1800 3.7728 4.2547 2.8758 3.4856 3.3035 2.9510 5.2334 5.1890 4.9698 2.6613 3.7964 4.0339 4.4286 3.9087 4.9500 1.3547 3.6312 4.0169 1.5405 1.6716 4.0517 3.1610 1.3989 1.7091 1.3110 1.1891 2.2537 1.7683 2.0724 1.4932 3.2401 1.3107 1.7052 1.5475 1.4300 2.2594 1.7338 1.8839 2.2308 1.4761 2.0065 1.2579 2.9984 1.4949 3.3850 2.2585 1.1122 1.6090 1.8850 1.0503 1.0435 2.7060 1.0746 1.6248 1.3056 3.5776 6.8209 6.7124 7.4494 6.0096 1.0407 1.0372 1.0368 1.0977 1.1018 1.0968 1.0869 1.0939 1.0992 1.0968 1.0853 1.0903 1.0919 1.0964 1.0953
irintensity: 6.7069 0.2331 0.1115 2.3122 0.1714 1.9640 3.4410 0.7708 0.2646 4.1754 1.7311 0.5373 1.5117 0.5358 0.6508 1.3125 0.6524 4.2530 0.6775 41.2012 4.0259 0.0098 0.3040 0.5276 0.9615 7.1816 0.2332 85.5486 0.8740 18.7916 15.0093 5.3527 7.7552 13.5661 1.4755 69.1454 1.4273 39.3128 20.9985 1.2837 2.9898 1.8963 26.2695 0.6662 36.8666 12.2114 1.6006 72.8168 5.3551 4.0390 407.6592 1.9813 6.8602 56.8477 166.0937 6.0524 61.7591 16.0113 26.6896 58.7944 17.7641 18.2251 29.5902 14.5613 4.5688 49.2803 25.3612 12.5159 516.7599 2.9586 3.4526 300.5982 39.3685 5.6326 72.4983 14.8333 19.7892 20.4251 3.5462 8.6931 23.5184 7.9282 0.1071 16.5088 21.7217 19.6004 19.6381
temp: 298.150 k
press: 1.00000 atm
elementType: 8 7 6 6 6 6 6 6 6 6 6 6 6 6 6 6 1 1 1 1 1 1 1 1 1 1 1 1 1 1 1
symmnumber: 1
zpe: 660290.1 jmol-1
zpe.correction: 0.251491 hartree
zpe.thermalcorrener: 0.267308 hartree
zpe.thermalcorrenthalpy: 0.268252 hartree
zpe.thermalcorrgfe: 0.207448 hartree
zpe.sumelectzpe: -671.322367 hartree
zpe.sumelectthermal: -671.306550 hartree
zpe.sumelectthermalent: -671.305606 hartree
zpe.sumelectthermalfe: -671.366410 hartree
dipole: 6.0094 0.4549 0.0110
dipole: 6.0266
quadrupole: -96.8700 -81.1411 -99.4163
quadrupole: 18.8253 0.0004 0.0077
quadrupole: -4.3942 11.3347 -6.9405 18.8253 0.0004 0.0077
hfenergy: -671.5738579 hartree
pointgroup: C01 [X(C14H15N1O1)]
dipole: -2.357836 0.2468852 0.0392689 debye
polarizability: 278.4870894|-4.1033092|199.644129|-3.3180209|2.6105489|78.5979326 unknown
InChI: InChI=1S/C14H15NO/c1-10(16)8-9-12-11(2)15(3)14-7-5-4-6-13(12)14/h4-9H,1-3H3
charge 0 multiplicity 1
31 atoms
O  4.425092 1.037749 -0.142544
N  -2.014691 1.347665 -0.031718
C  -2.10145 -0.058431 -0.060551
C  -0.765809 -0.584019 -0.093277
C  -0.668649 1.726996 -0.045805
C  0.146028 0.562786 -0.083783
C  -3.250611 -0.874288 -0.059356
C  -0.600247 -1.992169 -0.1253
C  -3.182896 2.230128 -0.000647
C  -0.264746 3.172753 -0.022077
C  1.586908 0.609264 -0.106014
C  -3.054034 -2.271161 -0.091925
C  -1.742388 -2.820934 -0.124344
C  2.497841 -0.424845 -0.146193
C  3.951104 -0.144869 -0.162691
C  4.877727 -1.359755 -0.204933
H  -4.260088 -0.450439 -0.034379
H  0.393583 -2.445774 -0.150361
H  -3.800372 2.027922 0.893783
H  -2.8604 3.281009 0.030747
H  -3.807859 2.083079 -0.900765
H  -0.631079 3.689318 0.885941
H  0.831298 3.266353 -0.033257
H  -0.652204 3.724593 -0.900117
H  2.052738 1.60659 -0.089016
H  -3.921571 -2.940097 -0.092135
H  -1.618455 -3.909123 -0.148908
H  2.191945 -1.47547 -0.167383
H  4.675035 -1.97171 -1.104746
H  5.928234 -1.031144 -0.216743
H  4.706814 -2.008377 0.675599
