program: Gaussian 09
title: 000282757
version: EM64L-G09RevD.01
frameworkgroup: C1[X(C17H12N2O)]
method: RPBEPBE
basis: SDD
operation: Freq
keyword: #p
keyword: freq=noraman
keyword: PBEPBE/SDD
title: #p freq=noraman PBEPBE/SDD
converged: NO YES NO NO
title: Mulliken charges:
elementType: O N N C C C C C C C C C C C C C C C C C H H H H H H H H H H H H
charge: -0.193943 -0.221728 -0.342679 -0.329234 -0.294606 0.510296 0.127206 0.311591 -0.550691 0.270517 0.290043 -0.307105 -0.363921 -0.359246 -0.431369 -0.211620 -0.242466 -0.204843 -0.241643 -0.241616 0.295079 0.289896 0.269446 0.236708 0.263090 0.280464 0.243827 0.228188 0.228148 0.233032 0.226235 0.232946
chargesum: 0.00000
title: Mulliken charges with hydrogens summed into heavy atoms:
elementType: O N N C C C C C C C C C C C C C C C C C
charge: -0.193943 -0.221728 -0.342679 -0.034156 -0.004710 0.510296 0.127206 0.311591 -0.281245 0.270517 0.290043 -0.070398 -0.100831 -0.078782 -0.187542 0.016567 -0.014318 0.028189 -0.015408 -0.008670
polarizability: 3.44738101e+02 9.08512651e+00 1.64067349e+02 -1.43808557e+01 2.12394240e+00 1.30424235e+02
1716.lowfreq: -3.4526 -0.0006 0.0003 0.0004 2.2566 9.2090 24.2837 42.8383 62.5587
frequency: 24.2564 42.8339 62.5542 106.3633 127.9706 161.1637 187.6636 197.3441 264.4470 286.9429 328.5643 381.4313 399.1837 407.4256 445.2279 466.6050 508.5546 550.2380 559.4323 571.5001 580.0797 610.1826 622.1329 648.1547 674.4196 693.8838 700.0720 711.1757 737.3444 758.2314 761.4097 783.4868 791.7559 830.3133 841.0683 842.7090 851.1174 879.3844 906.1000 921.8079 949.8841 974.2026 984.1612 985.7983 989.2853 996.3001 1009.3040 1021.5074 1023.8679 1068.9584 1079.5277 1100.8086 1132.6263 1143.7810 1163.0992 1170.1019 1170.1834 1182.6800 1200.1834 1236.2132 1264.3428 1278.4615 1307.3638 1311.0972 1320.1107 1357.1449 1379.7644 1404.6826 1436.9185 1453.8675 1467.2671 1474.5158 1585.1482 1588.4293 1603.2075 1609.0207 1624.2155 1669.8496 3119.4908 3132.3445 3133.8872 3145.4414 3145.8910 3160.9712 3162.4752 3168.8211 3173.5500 3180.2084 3180.8117 3223.5422
redmass: 4.1535 5.5028 5.1962 5.3555 5.6263 5.7625 6.0625 7.5563 4.4025 5.0705 5.0208 5.3577 4.5092 2.8915 3.5651 6.0365 3.8106 4.5794 5.9603 3.9811 5.2307 6.4595 5.2674 6.8385 6.8056 4.3581 2.0698 5.4878 3.5259 2.5068 1.4726 2.5923 4.8560 2.0320 1.3717 1.5159 3.8856 1.5173 2.5166 1.5495 1.3911 1.3728 1.3113 3.7233 4.3861 1.3255 2.0978 1.6911 1.9649 2.4899 1.5515 2.0007 2.0186 1.3389 1.6522 1.1046 1.4398 1.2023 2.5411 2.8772 1.5434 2.4966 2.4375 1.4247 2.5061 5.1010 7.5671 4.0183 2.2684 3.7001 2.9528 2.1913 6.6591 6.0518 7.0187 7.5430 7.7701 11.6559 1.0868 1.0857 1.0872 1.0929 1.0912 1.0963 1.0969 1.0904 1.0998 1.0978 1.0963 1.0985
irintensity: 0.5089 0.5378 0.3790 0.6303 2.8450 0.2877 3.0451 3.5329 0.3310 0.1307 1.9281 4.0821 2.5491 0.2531 5.9994 6.5875 13.0587 14.4717 1.3015 1.5417 0.9358 0.3899 1.5301 3.5449 3.3838 18.3254 38.8215 4.7484 28.2486 8.2181 73.2208 49.1992 23.8951 0.5224 16.4485 38.0227 6.3511 3.0900 14.3386 3.4465 6.5652 0.5449 0.1166 2.9299 3.4683 0.5168 1.1407 29.1304 2.7568 17.7065 7.5553 12.2514 19.0061 0.3685 26.9277 8.6316 53.0146 3.2181 48.7317 8.3879 11.9430 11.5118 65.1892 8.8752 9.9439 176.9589 0.6084 4.3480 7.9091 105.5505 16.2723 70.2573 3.8782 8.1348 42.1659 78.6285 12.3066 260.8525 11.7037 1.2021 0.3950 23.1270 15.2656 29.8454 30.9332 2.6886 14.4699 9.2298 8.0006 2.6689
temp: 298.150 k
press: 1.00000 atm
elementType: 8 7 7 6 6 6 6 6 6 6 6 6 6 6 6 6 6 6 6 6 1 1 1 1 1 1 1 1 1 1 1 1
symmnumber: 1
zpe: 639223.6 jmol-1
zpe.correction: 0.243467 hartree
zpe.thermalcorrener: 0.258175 hartree
zpe.thermalcorrenthalpy: 0.259119 hartree
zpe.thermalcorrgfe: 0.200467 hartree
zpe.sumelectzpe: -838.342332 hartree
zpe.sumelectthermal: -838.327624 hartree
zpe.sumelectthermalent: -838.326680 hartree
zpe.sumelectthermalfe: -838.385332 hartree
dipole: 1.9536 -2.8372 -2.0092
dipole: 3.9879
quadrupole: -93.2259 -119.9270 -110.8692
quadrupole: 2.7436 -4.6422 -1.4388
quadrupole: 14.7815 -11.9196 -2.8619 2.7436 -4.6422 -1.4388
hfenergy: -838.5857992 hartree
pointgroup: C01 [X(C17H12N2O1)]
dipole: -0.7552721 1.2976964 -0.4551507 debye
polarizability: 344.2782335|3.5886205|162.5057542|19.3909365|7.2593163|132.4456967 unknown
InChI: InChI=1S/C17H12N2O/c20-17-16-15(18(16)12-7-2-1-3-8-12)14-10-11-6-4-5-9-13(11)19(14)17/h1-10,15-16H
charge 0 multiplicity 1
32 atoms
O  0.813854 -2.754183 -0.679594
N  -1.439754 -0.154189 0.14946
N  1.360381 -0.450817 -0.423061
C  -0.665694 0.604094 -0.974856
C  -0.83776 -0.903882 -1.051845
C  0.7501 0.828254 -0.601223
C  0.501915 -1.541265 -0.70138
C  -2.891527 0.015259 0.14549
C  1.676137 1.8164 -0.327014
C  2.697886 -0.278436 -0.01637
C  2.921823 1.144164 0.045958
C  -3.712489 0.050097 -1.01302
C  -3.479362 0.163232 1.424454
C  3.694746 -1.224373 0.279632
C  4.200959 1.617421 0.424465
C  4.960924 -0.722248 0.656747
C  -5.106656 0.230686 -0.883165
C  -4.87373 0.345466 1.54856
C  5.209317 0.677074 0.728571
C  -5.692059 0.37937 0.39559
H  -1.229876 1.30203 -1.596057
H  -1.498851 -1.424875 -1.747285
H  1.509056 2.890833 -0.373101
H  -3.279464 -0.065133 -2.014361
H  -2.825507 0.127018 2.301098
H  3.492314 -2.296821 0.219583
H  4.405496 2.691764 0.482781
H  5.765908 -1.424481 0.898706
H  -5.736873 0.253487 -1.77917
H  -5.320107 0.456703 2.542708
H  6.203669 1.02762 1.025987
H  -6.774382 0.517234 0.491614
