program: Gaussian 09
title: 000282793
version: EM64L-G09RevD.01
frameworkgroup: C1[X(C13H14F2N2O5)]
method: RPBEPBE
basis: SDD
operation: Freq
keyword: #p
keyword: freq=noraman
keyword: PBEPBE/SDD
title: #p freq=noraman PBEPBE/SDD
converged: YES YES NO NO
title: Mulliken charges:
elementType: F F O O O O O N N C C C C C C C C C C C C C H H H H H H H H H H H H H H
charge: -0.218582 -0.212713 -0.397547 -0.285467 -0.240677 -0.417904 -0.224709 -0.458765 -0.394092 -0.135106 -0.391637 -0.483651 0.158065 0.114828 0.397775 -0.516520 -0.544102 0.181005 0.093602 0.245897 0.263483 -0.602627 0.311341 0.252195 0.283555 0.256726 0.269163 0.348750 0.238052 0.302287 0.329432 0.390894 0.246689 0.245707 0.215796 0.378857
chargesum: 0.00000
title: Mulliken charges with hydrogens summed into heavy atoms:
elementType: F F O O O O O N N C C C C C C C C C C C C C
charge: -0.218582 -0.212713 -0.006653 -0.285467 -0.240677 -0.039047 -0.224709 -0.110015 -0.064660 0.176235 0.144114 0.042237 0.158065 0.114828 0.397775 -0.278468 -0.241815 0.181005 0.093602 0.245897 0.263483 0.105565
polarizability: 2.65831295e+02 2.03800951e+01 1.20316636e+02 -2.17081445e+01 4.60168188e+00 1.69173604e+02
1716.lowfreq: -0.0011 -0.0009 -0.0005 2.4104 4.2114 6.3114 13.2310 15.3334 21.0531
frequency: 13.1014 15.2957 21.0350 40.7792 53.4833 57.7684 63.0501 77.3415 91.7247 112.3500 126.0215 144.0735 169.2400 184.2718 196.1913 203.2261 218.2785 252.1366 278.7950 301.3611 311.5420 324.2628 337.5918 413.8049 424.0178 446.4202 470.9283 499.4789 503.6691 507.5192 521.0235 544.0472 558.2612 562.3879 587.9158 594.0991 616.3732 636.3231 638.7014 707.7899 715.4696 724.4499 735.9832 767.5520 780.5605 850.0004 856.6519 890.6618 908.6024 918.7203 951.7158 963.0151 1027.0792 1043.4699 1054.7779 1062.7932 1093.9603 1098.2966 1122.3438 1137.2729 1150.3587 1177.6396 1205.1290 1213.5528 1223.6316 1244.2616 1267.9635 1284.2168 1289.3056 1330.6924 1335.9726 1355.5864 1373.2990 1380.5313 1440.1945 1448.7289 1451.3719 1469.2000 1469.2769 1472.9361 1486.7167 1498.3642 1552.1206 1559.3850 1589.3155 1644.5952 1646.2245 1670.3570 2988.2347 2990.9222 2999.3819 3036.1215 3042.2277 3069.9106 3101.3339 3103.9952 3160.4390 3177.8315 3514.0929 3515.7954 3519.0107 3571.5022
redmass: 9.2983 12.5074 7.2729 6.2257 8.1946 6.4245 4.7431 5.1287 2.9649 1.9513 3.8993 3.2728 2.5171 5.5846 3.9576 6.0776 6.0673 4.6910 7.5950 9.1592 5.0907 6.2382 5.8843 5.6192 4.8560 4.7777 6.3337 3.5249 1.7235 1.4526 4.0865 4.9790 3.3260 3.1597 4.9252 1.3446 4.0947 1.4265 1.5920 5.1290 7.4921 3.9849 4.3158 2.7345 2.1274 1.5997 3.5667 4.4877 1.4432 4.0116 7.4032 3.4843 2.7591 2.7456 3.0766 2.2101 1.8646 2.2952 1.2722 2.6701 1.6686 1.3257 2.5756 1.6820 1.5041 1.4468 1.5816 1.5611 1.4229 2.0980 1.7906 3.0985 4.0867 1.7716 1.1130 1.2778 3.3999 1.0428 1.1079 1.7351 1.9913 1.2187 5.9208 3.8250 5.8024 8.5337 8.5808 8.2640 1.0345 1.0613 1.0815 1.0622 1.0967 1.1021 1.1038 1.1005 1.0914 1.0926 1.0640 1.0763 1.0650 1.0766
irintensity: 0.2240 0.5984 0.2051 4.1918 0.5497 0.9189 0.3989 2.0193 0.8373 2.7019 0.3080 5.3807 0.7876 10.5476 0.2233 0.3774 12.3834 1.3523 0.2227 6.3043 4.2671 1.5591 1.7294 2.5204 27.2810 31.0527 7.5049 40.8932 14.9663 101.4706 15.4033 46.9351 102.5010 9.8740 14.8380 13.1920 6.3697 119.9183 125.7331 27.7001 2.5357 46.1189 20.0047 21.7213 30.6039 14.6303 8.0597 4.2694 27.5987 4.2207 105.6610 5.7608 100.8309 154.9686 164.6569 161.7145 4.3236 41.0529 1.1677 18.5487 19.0261 2.3541 22.4152 4.0378 7.5021 9.0639 70.2859 94.8523 3.3772 2.7267 54.8403 233.7657 218.4596 74.4012 44.6397 55.8827 47.3255 14.3736 21.6599 17.8165 456.5671 145.9318 290.5089 82.4741 29.5100 62.2453 329.1109 215.0771 86.1265 9.7501 17.3370 8.2268 5.6995 34.2606 9.6755 21.3148 2.5723 6.7683 22.9900 84.5232 23.1972 105.6847
temp: 298.150 k
press: 1.00000 atm
elementType: 9 9 8 8 8 8 8 7 7 6 6 6 6 6 6 6 6 6 6 6 6 6 1 1 1 1 1 1 1 1 1 1 1 1 1 1
symmnumber: 1
zpe: 691147.2 jmol-1
zpe.correction: 0.263244 hartree
zpe.thermalcorrener: 0.285780 hartree
zpe.thermalcorrenthalpy: 0.286724 hartree
zpe.thermalcorrgfe: 0.206937 hartree
zpe.sumelectzpe: -1187.488755 hartree
zpe.sumelectthermal: -1187.466220 hartree
zpe.sumelectthermalent: -1187.465276 hartree
zpe.sumelectthermalfe: -1187.545063 hartree
dipole: 1.7307 -0.8016 -3.8405
dipole: 4.2880
quadrupole: -93.4864 -120.0190 -142.2707
quadrupole: 10.7882 5.8585 -5.5566
quadrupole: 25.1057 -1.4270 -23.6787 10.7882 5.8585 -5.5566
hfenergy: -1187.7519994 hartree
pointgroup: C01 [X(C13H14F2N2O5)]
dipole: -0.6711015 0.8141559 -1.3163912 debye
polarizability: 264.4394681|13.9537114|129.7365302|29.5891567|-18.834557|161.145537 unknown
InChI: InChI=1S/C13H14F2N2O5/c1-16-11-7(14)4-6(5-8(11)15)12(20)17-9(13(21)22)2-3-10(18)19/h4-5,9,16-18,21H,2-3H2,1H3
charge 0 multiplicity 1
36 atoms
F  -4.474149 -1.330794 1.796814
F  -3.24636 0.829089 -2.362385
O  4.329652 2.533079 0.787026
O  0.537403 -0.525417 2.24169
O  2.508115 2.91165 -0.602035
O  4.401069 -2.174076 -2.414319
O  4.868432 -2.595391 -0.178957
N  1.115388 0.827652 0.451913
N  -5.271219 -0.410496 -0.627802
C  2.490438 0.97916 0.940544
C  3.381962 -0.273841 0.681356
C  3.495874 -0.627931 -0.811026
C  0.197495 0.070426 1.165892
C  3.068962 2.229247 0.287797
C  -1.194948 -0.011762 0.622302
C  -1.587918 0.46927 -0.654289
C  -2.176637 -0.627015 1.445388
C  4.316513 -1.880989 -1.042832
C  -3.943404 -0.25344 -0.285379
C  -3.480981 -0.72442 0.98404
C  -2.916106 0.34211 -1.073467
C  -5.920065 0.025796 -1.87164
H  2.469344 1.128981 2.038426
H  4.380886 -0.088667 1.112378
H  2.933564 -1.111789 1.240848
H  3.960402 0.187782 -1.399588
H  2.494842 -0.788509 -1.255098
H  0.835212 1.447043 -0.313609
H  -0.883998 0.922552 -1.359287
H  -1.886098 -1.015411 2.425564
H  -5.84633 -0.873138 0.076203
H  4.68193 3.351177 0.34243
H  -5.486746 -0.468785 -2.758863
H  -5.840646 1.117948 -2.01573
H  -6.988167 -0.240358 -1.811501
H  4.941491 -3.001335 -2.538107
