program: Gaussian 09
title: 000282704
version: EM64L-G09RevD.01
frameworkgroup: C1[X(C13H10N2O)]
method: RPBEPBE
basis: SDD
operation: Freq
keyword: #p
keyword: freq=noraman
keyword: PBEPBE/SDD
title: #p freq=noraman PBEPBE/SDD
converged: YES YES NO NO
title: Mulliken charges:
elementType: O N N C C C C C C C C C C C C C H H H H H H H H H H
charge: -0.211402 -0.000175 0.001407 0.526893 -0.297841 0.486602 -0.464556 -0.297441 -0.382600 0.133107 -0.211053 -0.317992 -0.321158 -0.335544 -0.350439 -0.346115 0.225812 0.212308 0.275129 0.233007 0.240084 0.264910 0.223869 0.227592 0.242547 0.243046
chargesum: 0.00000
title: Mulliken charges with hydrogens summed into heavy atoms:
elementType: O N N C C C C C C C C C C C C C
charge: -0.211402 -0.000175 0.001407 0.526893 -0.072029 0.486602 -0.189427 -0.085132 -0.149593 0.133107 0.029032 -0.053082 -0.097290 -0.107951 -0.107891 -0.103069
polarizability: 3.31138105e+02 8.85230419e+00 1.76278044e+02 1.47124932e-02 4.91556355e-02 6.06202947e+01
1716.lowfreq: -0.0007 -0.0002 0.0006 5.3564 5.4167 13.0929 26.2507 58.2896 62.7937
frequency: 25.7598 58.2886 62.7936 95.8382 116.6460 171.9009 199.8319 222.4329 244.9538 286.4829 309.5682 368.0539 433.6821 438.4033 469.3204 506.4091 531.6282 585.2112 636.7490 649.1388 661.8809 682.5006 741.8202 766.3857 808.2391 823.0122 859.9907 871.9812 891.7955 926.0568 935.4108 942.7693 959.9810 963.8859 975.9319 984.3693 989.9621 1000.1177 1059.5692 1084.9539 1089.5704 1089.9343 1180.9394 1208.1889 1221.3736 1245.8805 1282.9473 1294.5209 1315.7981 1322.9995 1343.4614 1347.1853 1401.1166 1409.3627 1430.6085 1465.4997 1476.4449 1542.2679 1579.5729 1583.2876 1599.2532 1649.1785 3097.7785 3109.3972 3126.0041 3132.0517 3136.1351 3139.0407 3148.7569 3154.6902 3158.6944 3171.8545
redmass: 4.1144 5.7704 6.5558 3.5977 6.8775 7.3944 6.6027 2.8530 4.5674 4.5688 5.6325 2.4767 7.9263 3.0311 4.3763 3.2737 7.6800 4.2219 6.5777 8.0340 7.0171 1.9394 3.0374 6.9810 1.3908 1.5141 4.1926 1.3551 1.6945 3.9865 1.5325 1.4458 7.2429 1.3961 1.4930 6.1791 1.1957 1.3309 2.1826 1.5935 1.5928 2.1640 1.1440 2.6847 1.3410 1.3926 3.6373 1.6704 2.9099 1.5625 2.8379 1.5474 4.0761 2.4422 3.3598 2.0505 2.4762 6.5556 5.8061 5.7654 6.1637 5.3139 1.0922 1.0865 1.0874 1.0878 1.0907 1.0868 1.0968 1.0916 1.0978 1.0991
irintensity: 0.8096 0.2396 2.5830 0.1528 0.0763 1.7087 0.1611 0.1488 2.3921 1.0357 0.9012 0.0172 2.2606 0.3375 1.9279 10.4077 21.5295 11.0726 1.1899 15.9385 1.2294 35.3694 3.9344 24.9108 0.8396 80.3808 2.0626 1.1399 10.6441 29.5246 0.4739 6.2849 2.6745 4.9705 0.2551 0.2192 50.9138 12.4805 1.7655 44.2220 6.7874 110.1928 0.5696 27.2001 8.4947 3.0627 25.4572 15.0017 0.2307 22.7311 125.7804 24.1204 9.6752 21.7984 16.0997 0.0261 32.2009 15.7496 38.6597 42.8958 36.6467 0.8940 3.7642 31.2788 10.8545 11.6211 6.2108 3.7268 44.1102 6.7052 9.2154 14.6420
temp: 298.150 k
press: 1.00000 atm
elementType: 8 7 7 6 6 6 6 6 6 6 6 6 6 6 6 6 1 1 1 1 1 1 1 1 1 1
symmnumber: 1
zpe: 513183.0 jmol-1
zpe.correction: 0.195461 hartree
zpe.thermalcorrener: 0.208718 hartree
zpe.thermalcorrenthalpy: 0.209662 hartree
zpe.thermalcorrgfe: 0.153778 hartree
zpe.sumelectzpe: -684.918320 hartree
zpe.sumelectthermal: -684.905063 hartree
zpe.sumelectthermalent: -684.904119 hartree
zpe.sumelectthermalfe: -684.960002 hartree
dipole: 0.3648 4.2262 -0.0046
dipole: 4.2419
quadrupole: -127.4417 -83.0619 -97.2041
quadrupole: -10.2263 0.0280 0.0335
quadrupole: -24.8725 19.5073 5.3652 -10.2263 0.0280 0.0335
hfenergy: -685.1137808 hartree
pointgroup: C01 [X(C13H10N2O1)]
dipole: -0.1262222 1.6409732 0.2766551 debye
dipolederiv: -0.1684387 -0.182007 -0.0289965 0.8819827 -0.9793941 -0.1730916 0.1473417 -0.1327119 -0.1647457 -0.5570265 -0.0083589 0.0099436 -0.118241 -0.3515787 -0.0115538 -0.0079881 -0.0156499 -0.2551542 0.6151251 -0.3929781 -0.0953672 -1.2382619 1.0812066 0.2561555 -0.2352481 0.2240172 -0.1341097 0.5287503 0.0938322 -0.0031005 0.1926978 -0.2995982 -0.0616392 0.0141033 -0.0580058 0.0195431 0.0132611 0.0202218 -0.0024323 0.1458086 0.1137839 0.036387 0.0174316 0.0412348 -0.1364198 0.6812957 0.0168535 -0.0201761 0.1016852 0.0842758 -0.0005947 -0.0059474 0.0025506 0.0644936 -0.1733729 -0.2217853 -0.034317 0.078117 0.0027232 0.0150634 0.0153801 0.0265872 -0.1024404 -0.1651924 0.0051688 0.0008726 0.169018 0.1634275 0.047943 0.0274252 0.0540778 -0.1609516 -0.0635577 -0.0110093 -0.0033986 -0.0907397 0.1182079 0.0390198 -0.016798 0.0357598 -0.0899937 -0.5384488 0.5621658 0.1185835 0.4312098 -0.3569982 -0.0972557 0.096428 -0.1020486 0.1102262 -0.345506 0.0668333 0.0184481 0.1605583 0.2078009 0.0533152 0.0342192 0.0569201 -0.1432245 -0.0314294 0.0625391 0.0073765 -0.3732696 0.0935068 0.0470056 -0.0646391 0.030469 -0.097753 -0.3840681 -0.1993071 -0.0216439 -0.1956201 -0.1406493 0.0009002 -0.021318 0.0010805 -0.1010781 -0.5648647 0.1311918 0.0374801 -0.0407173 0.0328485 0.0273795 0.0093196 0.0210162 -0.1235026 0.2308554 0.1781599 0.017454 0.1595074 0.3417953 0.0615409 0.0144096 0.0609787 -0.0657873 0.5137339 -0.2032043 -0.0544373 -0.0674484 0.1839005 0.0434412 -0.0321884 0.0484325 -0.0604114 0.0553954 -0.000512 0.003379 -0.0941973 -0.0731712 -0.0324466 -0.0119783 -0.0360488 0.1415236 0.0657454 -0.0170163 0.0000934 -0.0961341 -0.0934642 -0.0353446 -0.0128048 -0.0382826 0.1395209 0.096694 -0.0267319 -0.0020644 -0.0997763 0.0260386 -0.018011 -0.0141207 -0.0208558 0.1548723 0.0134866 0.1102808 0.0231277 0.0791429 0.0279151 -0.0215222 0.017923 -0.0225987 0.1352612 0.0633186 -0.0360021 -0.0023233 -0.0637188 -0.0881745 -0.0384016 -0.0068492 -0.0394729 0.1522238 -0.0174878 -0.0504958 -0.0013029 -0.0199363 0.1022673 -0.0098291 0.0036758 -0.0086389 0.1647899 0.011744 0.1175779 0.0238917 0.0829821 0.012103 -0.0245482 0.0183622 -0.025842 0.140138 0.0944577 -0.0830025 -0.0112449 -0.0366353 -0.0846334 -0.0374392 -0.003758 -0.0358279 0.1494494 0.0623317 -0.0398919 -0.0036406 -0.0631613 -0.103591 -0.0367648 -0.007435 -0.0377306 0.132354 -0.0368019 0.1074775 0.0237952 0.1151476 -0.020548 -0.029709 0.0250536 -0.0294101 0.131176 unknown
polarizability: 330.5693453|-8.6806185|173.3229321|-11.5538694|18.826182|64.1441659 unknown
InChI: InChI=1S/C13H10N2O/c16-15-13-3-1-2-12(10-13)5-4-11-6-8-14-9-7-11/h1-10H
charge 0 multiplicity 1
26 atoms
O  4.481593 -2.373808 -0.631779
N  -5.389951 -0.637504 0.028128
N  4.80932 -1.147335 -0.440633
C  1.289315 0.306517 -0.065495
C  -0.110446 -0.149428 -0.088193
C  -2.62179 0.157749 0.054702
C  2.321826 -0.643027 -0.261682
C  -1.227059 0.625358 0.079507
C  1.665873 1.673529 0.14606
C  3.67918 -0.236546 -0.246412
C  3.017268 2.071646 0.160114
C  4.0397 1.116965 -0.036801
C  -3.008088 -1.19917 -0.150727
C  -3.675366 1.096601 0.245372
C  -4.374957 -1.53967 -0.155198
C  -5.017823 0.662963 0.224693
H  -0.237444 -1.227304 -0.259619
H  -1.109687 1.704693 0.251329
H  2.097144 -1.703623 -0.428851
H  0.890706 2.431707 0.301027
H  3.273052 3.123309 0.324284
H  5.101286 1.385878 -0.033129
H  -2.26333 -1.986254 -0.305445
H  -3.448767 2.156649 0.408653
H  -4.688991 -2.5779 -0.311668
H  -5.837766 1.375307 0.37016
