program: Gaussian 09
title: 000282734
version: EM64L-G09RevD.01
frameworkgroup: C1[X(C12H14N6O4)]
method: RPBEPBE
basis: SDD
operation: Freq
keyword: #p
keyword: freq=noraman
keyword: PBEPBE/SDD
title: #p freq=noraman PBEPBE/SDD
converged: YES YES NO NO
title: Mulliken charges:
elementType: O O O O N N N N N N C C C C C C C C C C C C H H H H H H H H H H H H H H
charge: -0.261386 -0.454784 -0.485664 -0.447080 -0.143287 -0.230316 -0.062657 -0.383051 -0.491272 -0.033506 -0.053503 -0.186514 -0.227212 -0.014721 -0.372287 0.237810 -0.309461 -0.051699 0.272244 0.144930 -0.314011 -0.253104 0.239450 0.265771 0.268914 0.237297 0.205491 0.223978 0.289642 0.354027 0.414327 0.379040 0.261498 0.362468 0.309746 0.308884
chargesum: 0.00000
title: Mulliken charges with hydrogens summed into heavy atoms:
elementType: O O O O N N N N N N C C C C C C C C C C C C
charge: -0.261386 -0.100758 -0.071337 -0.068040 -0.143287 -0.230316 -0.062657 -0.020583 0.127358 -0.033506 0.185946 0.079257 0.041702 0.222575 0.057182 0.237810 -0.019819 -0.051699 0.272244 0.144930 -0.052513 -0.253104
polarizability: 2.62333324e+02 -4.02774313e+00 1.94366367e+02 -9.33442579e+00 1.04604521e+01 1.10920972e+02
1716.lowfreq: -11.5050 -1.9876 -0.0004 0.0005 0.0007 4.0235 28.3793 37.6906 62.2128
frequency: 27.8168 37.6853 62.2012 87.7804 100.7395 104.1252 114.0034 115.1765 138.4423 143.0728 184.8076 201.6589 212.8382 230.9204 257.7069 279.3437 289.6463 295.9167 321.5332 341.0024 349.9840 390.6077 423.7812 433.6077 456.0634 504.3920 536.3202 553.8813 569.4625 585.1156 591.1095 617.4937 647.9785 669.8562 691.8947 707.4677 715.1966 738.5861 763.8730 792.8427 796.8351 803.4960 817.2825 820.5798 904.6369 928.4118 936.1911 940.3614 967.6145 986.1229 998.6069 1004.8985 1015.5062 1024.2031 1034.9901 1047.4274 1107.7005 1142.7280 1175.0336 1186.9081 1193.9251 1201.5884 1202.6751 1219.4225 1250.3949 1270.0745 1275.4410 1283.1244 1286.9338 1308.1078 1324.1913 1329.5951 1341.8983 1351.9826 1357.1544 1372.6122 1396.8777 1411.6962 1425.7803 1444.7499 1465.2063 1470.1718 1520.5186 1550.4868 1561.9472 1585.6238 1679.4954 2176.9770 2614.2801 2977.7505 3004.5238 3015.0144 3021.3514 3060.7802 3093.5172 3173.1872 3239.7971 3360.2351 3395.8487 3512.6992 3543.6381 3579.5582
redmass: 5.7689 7.2403 5.8840 5.7091 8.0239 3.2532 2.1365 3.2663 3.6831 2.3796 6.6614 6.6514 5.9127 6.4040 6.4326 5.8181 5.7454 4.5793 1.2370 5.9663 5.6389 4.8819 7.4690 5.6579 6.9324 8.0123 8.7545 4.8908 6.2614 3.8459 1.1613 6.6821 3.4546 8.5808 4.7734 3.0539 4.6237 2.9015 1.2292 7.4993 3.1279 5.2196 5.7417 1.5938 4.1372 1.4386 3.6976 2.4842 3.9870 1.8438 3.8666 2.4159 2.8490 6.3620 3.2413 2.5612 2.6747 2.0850 1.7899 1.3479 1.3708 2.5815 1.8253 4.3968 1.2189 1.1837 1.6283 1.5449 1.1549 1.4354 1.6201 3.0933 2.8340 1.3294 2.4973 1.9721 1.9840 1.2214 2.4141 2.2832 2.7003 1.0786 5.4972 1.4369 3.3881 5.0165 1.0625 12.5884 1.0800 1.0679 1.0847 1.0871 1.0853 1.0879 1.0974 1.0933 1.0995 1.0654 1.0429 1.0990 1.0799 1.0664
irintensity: 1.0867 1.2691 0.3353 0.6667 6.7327 3.8359 18.3650 10.7094 1.9169 11.2922 2.4327 10.6970 5.0330 7.9829 0.9258 4.2237 1.9953 7.2777 158.9090 6.7806 5.7191 2.6840 0.4199 3.5524 3.8057 3.0197 11.2346 0.4432 5.9903 7.4585 149.5174 3.9827 9.1202 2.7728 15.4807 46.1988 95.4317 22.8440 104.9675 18.1219 141.0534 42.6342 18.3382 29.5882 28.2023 24.6271 42.9458 9.0340 102.1875 71.5809 41.7731 211.0778 15.1517 40.4190 24.4216 44.4243 5.9352 33.0289 16.3207 46.6135 44.0311 4.5055 33.8844 14.4357 3.8149 2.1723 33.1402 2.7308 0.4610 5.6959 8.4095 9.1618 110.3211 14.0616 3.0983 67.5471 17.3640 122.4523 34.5192 33.5247 28.1591 4.5857 93.0342 15.2050 142.1004 442.0469 28.6084 96.5692 2137.8502 41.8787 36.7776 39.7795 18.1393 19.8441 44.2546 6.2307 6.1388 88.6110 1.0445 3.9720 80.5896 14.9844
temp: 298.150 k
press: 1.00000 atm
elementType: 8 8 8 8 7 7 7 7 7 7 6 6 6 6 6 6 6 6 6 6 6 6 1 1 1 1 1 1 1 1 1 1 1 1 1 1
symmnumber: 1
zpe: 710440.0 jmol-1
zpe.correction: 0.270592 hartree
zpe.thermalcorrener: 0.290422 hartree
zpe.thermalcorrenthalpy: 0.291366 hartree
zpe.thermalcorrgfe: 0.221928 hartree
zpe.sumelectzpe: -1093.406085 hartree
zpe.sumelectthermal: -1093.386255 hartree
zpe.sumelectthermalent: -1093.385311 hartree
zpe.sumelectthermalfe: -1093.454749 hartree
dipole: -0.2792 0.7364 -2.8048
dipole: 2.9133
quadrupole: -155.5817 -132.1912 -125.2298
quadrupole: 27.5276 -5.2403 -1.3690
quadrupole: -17.9142 5.4764 12.4378 27.5276 -5.2403 -1.3690
hfenergy: -1093.6766773 hartree
pointgroup: C01 [X(C12H14N6O4)]
dipole: -0.1145952 0.4569719 -1.0448753 debye
polarizability: 262.2201507|-2.5235907|189.1842936|-10.5701188|22.7328426|116.2162179 unknown
InChI: InChI=1S/C12H14N6O4/c13-1-5-2-18(11-7(5)10(17-14)15-4-16-11)12-9(21)8(20)6(3-19)22-12/h2,4,6,8-9,12,17,19-21H,3,14H2
charge 0 multiplicity 1
36 atoms
O  2.210193 0.587881 1.250265
O  3.173199 2.38218 -1.324464
O  2.725688 -1.334287 -1.205877
O  4.576749 -2.201788 0.6036
N  0.171563 1.145692 0.14979
N  0.14917 -1.196184 -0.658256
N  -2.070498 -2.197999 -0.778953
N  -4.0337 -1.041163 -0.178238
N  -4.861511 -2.154476 -0.476334
N  -4.397428 2.493481 1.078382
C  1.618808 1.419799 0.203335
C  2.407805 1.145637 -1.113266
C  3.321509 -0.07272 -0.790644
C  3.511067 0.036995 0.746127
C  3.76194 -1.321475 1.441404
C  -0.452476 -0.058247 -0.198041
C  -0.808205 2.04479 0.573111
C  -1.854369 0.094892 -0.00747
C  -2.071892 1.443176 0.484898
C  -2.665867 -1.045264 -0.31928
C  -0.718793 -2.21408 -0.925983
C  -3.322191 2.035839 0.814263
H  1.729047 2.493552 0.446713
H  1.749579 0.926539 -1.975764
H  4.288771 0.00057 -1.315553
H  4.305946 0.776106 0.966523
H  2.775119 -1.770861 1.676631
H  4.325182 -1.189735 2.378293
H  -0.545888 3.044951 0.91035
H  3.742027 2.284217 -2.1288
H  1.712044 -1.34336 -0.956437
H  4.033679 -2.347808 -0.227062
H  -0.27965 -3.143976 -1.297131
H  -4.523205 -0.211134 0.161954
H  -4.615881 -2.956484 0.121549
H  -4.775631 -2.411053 -1.470135
