program: Gaussian 09
title: 000025023
version: EM64L-G09RevD.01
frameworkgroup: C1[X(C16H17N)]
method: RPBEPBE
basis: SDD
operation: Freq
keyword: #pfreq=noraman
keyword: PBEPBE/SDD
title: #p freq=noraman PBEPBE/SDD
converged: YES YES NO NO
title: Mulliken charges:
elementType: N C C C C C C C C C C C C C C C C H H H H H H H H H H H H H H H H H
charge: -0.104485 -0.376649 -0.491295 -0.536027 0.269257 0.272499 -0.488997 -0.378621 -0.392672 0.447837 -0.248994 -0.245613 -0.376269 -0.448474 -0.231643 -0.221437 -0.245629 0.188666 0.213921 0.254818 0.196875 0.208713 0.232970 0.224404 0.188339 0.231702 0.231040 0.225681 0.225246 0.268454 0.231237 0.224846 0.223719 0.226581
chargesum: 0.00000
title: Mulliken charges with hydrogens summed into heavy atoms:
elementType: N C C C C C C C C C C C C C C C C
charge: -0.104485 0.025938 -0.039602 -0.094344 0.269257 0.272499 -0.076254 -0.146920 -0.161632 0.447837 -0.023313 -0.020367 -0.107815 -0.217237 -0.006797 0.002282 -0.019048
polarizability: 2.15613690e+02 -9.58336207e+00 1.59331270e+02 -1.89765496e+01 1.10420050e+00 1.32697602e+02
1716.lowfreq: -14.7118 -0.0006 -0.0003 0.0002 4.2074 7.4290 31.4547 39.4159 44.5617
frequency: 31.4515 39.3808 44.4743 100.6751 139.1923 185.7862 207.5720 249.8623 259.2022 300.8223 330.1464 386.4124 406.6469 425.0199 431.4032 456.3843 498.7812 503.0899 582.1457 592.6016 615.6462 639.6174 705.0589 712.6861 732.0468 742.5519 751.7705 801.0026 808.8239 846.7075 859.8225 867.4638 914.2348 929.6911 939.5016 973.5252 983.2856 984.2001 989.8544 991.9433 999.9449 1012.2671 1026.0974 1037.8026 1059.9451 1077.8688 1098.6071 1136.8340 1143.5252 1169.4937 1172.8376 1179.3529 1190.3968 1200.4469 1210.3527 1214.5925 1232.2068 1243.1953 1268.8173 1291.1438 1311.6372 1330.9014 1345.3400 1357.5603 1377.2154 1387.6875 1395.6886 1439.4807 1442.9270 1444.9504 1457.1040 1464.5928 1479.2915 1482.6520 1491.7772 1593.9445 1595.4458 1614.2447 1616.8957 2800.0932 2834.4705 2853.5596 2978.3090 2987.5169 3019.0218 3031.4919 3035.6549 3109.6746 3111.1322 3113.9858 3122.3686 3135.1352 3135.2397 3146.6685 3157.8168 3160.9137
redmass: 3.8284 4.7445 3.7389 3.5698 2.8177 4.0067 3.0273 3.4240 2.7056 2.5627 2.4639 3.0956 2.8674 3.2465 3.0598 3.0803 3.9865 3.6925 4.0085 5.0396 6.2507 3.5565 2.1902 3.3387 3.7681 1.4915 1.3198 2.4565 3.7838 3.8167 1.2514 1.3369 1.3728 2.4478 1.3892 1.9481 1.3894 1.3250 5.0854 1.8130 1.3875 2.3056 2.1102 2.1892 2.1263 1.6156 2.3986 1.8456 2.5094 1.0619 1.0586 1.1161 1.1891 1.9538 2.3516 1.4654 1.4207 1.6829 1.5213 1.4684 1.3693 1.4027 1.4733 1.7450 2.8588 4.4566 2.1535 2.1042 2.1200 1.1727 1.1186 1.1230 1.3710 1.6106 2.3842 6.1689 6.7721 6.1225 6.4961 1.0715 1.0706 1.0708 1.0605 1.0861 1.0847 1.0909 1.0979 1.0865 1.0870 1.0893 1.0862 1.0914 1.0927 1.0955 1.1004 1.1014
irintensity: 0.1318 0.0568 0.1090 0.5650 0.8473 0.4330 2.7577 3.6137 6.1732 1.2921 3.7489 2.6036 0.4037 1.4728 5.6368 7.0928 4.2430 0.4278 0.3051 1.7221 0.2865 2.4794 33.4839 2.7097 5.3717 56.3378 91.4126 1.3959 2.3147 9.2115 0.1602 0.7295 2.0510 21.2134 1.9385 5.1329 0.1767 0.1082 0.2123 1.3083 1.7530 10.0312 13.4690 4.2446 7.9261 13.9707 37.8619 29.3741 4.4533 0.5408 0.2987 2.0562 3.9660 1.2110 6.6177 0.1601 12.1926 13.6847 1.6861 13.8523 19.2600 7.4819 4.3482 10.6900 3.2391 4.5175 2.2422 9.8656 4.7370 15.5582 10.2349 4.4131 14.2555 12.3327 18.6523 0.8289 3.8902 7.0616 1.1788 57.5124 50.1856 174.5612 28.7793 18.9283 19.1542 42.6882 42.7344 15.3166 8.9077 2.4822 0.3384 19.5269 30.0749 32.1935 36.3570 27.3286
temp: 298.150 k
press: 1.00000 atm
elementType: 7 6 6 6 6 6 6 6 6 6 6 6 6 6 6 6 6 1 1 1 1 1 1 1 1 1 1 1 1 1 1 1 1 1
symmnumber: 1
zpe: 749392.3 jmol-1
zpe.correction: 0.285428 hartree
zpe.thermalcorrener: 0.299404 hartree
zpe.thermalcorrenthalpy: 0.300348 hartree
zpe.thermalcorrgfe: 0.243332 hartree
zpe.sumelectzpe: -673.431378 hartree
zpe.sumelectthermal: -673.417402 hartree
zpe.sumelectthermalent: -673.416458 hartree
zpe.sumelectthermalfe: -673.473474 hartree
dipole: 0.0365 0.7985 -0.6420
dipole: 1.0252
quadrupole: -96.3888 -94.4490 -98.9334
quadrupole: -3.1453 -4.1790 0.0493
quadrupole: 0.2016 2.1414 -2.3430 -3.1453 -4.1790 0.0493
hfenergy: -673.7168059 hartree
pointgroup: C01 [X(C16H17N1)]
dipole: -0.0003311 -0.2425337 -0.3222853 debye
polarizability: 212.626154|-15.5535329|158.9623258|21.0384447|4.002302|136.0540823 unknown
InChI: InChI=1S/C16H17N/c1-2-6-14(7-3-1)12-17-11-10-15-8-4-5-9-16(15)13-17/h1-9H,10-13H2
charge 0 multiplicity 1
34 atoms
N  -0.075655 -1.092542 -0.370835
C  0.890077 -2.188482 -0.617035
C  0.497603 0.227225 -0.718845
C  2.076532 -2.055245 0.354952
C  1.89892 0.436471 -0.158959
C  2.667428 -0.651855 0.332724
C  -1.393095 -1.310563 -1.006108
C  2.456663 1.739262 -0.159727
C  3.979424 -0.409912 0.813304
C  -2.488545 -0.407256 -0.442465
C  3.761699 1.972458 0.322146
C  4.529432 0.88935 0.812443
C  -2.528804 -0.103726 0.942041
C  -3.508202 0.099628 -1.284662
C  -3.571675 0.686241 1.473268
C  -4.557121 0.886568 -0.754759
C  -4.592499 1.18203 0.627302
H  1.263615 -2.183044 -1.673686
H  0.37442 -3.152758 -0.453509
H  -0.179111 1.013581 -0.336458
H  0.536827 0.359955 -1.834907
H  2.85538 -2.802377 0.107308
H  1.717149 -2.284609 1.377561
H  -1.671758 -2.368019 -0.822249
H  -1.350743 -1.180821 -2.119109
H  1.859089 2.578408 -0.538698
H  4.573229 -1.252737 1.189663
H  4.176722 2.98656 0.317772
H  5.545412 1.057768 1.186996
H  -1.724782 -0.484909 1.581708
H  -3.481505 -0.12046 -2.35971
H  -3.589811 0.916266 2.544926
H  -5.339718 1.272031 -1.41841
H  -5.402499 1.794514 1.039519
