program: Gaussian 09
title: 000282710
version: EM64L-G09RevD.01
frameworkgroup: C1[X(C17H13NO3)]
method: RPBEPBE
basis: SDD
operation: Freq
keyword: #p
keyword: freq=noraman
keyword: PBEPBE/SDD
title: #p freq=noraman PBEPBE/SDD
converged: YES YES NO NO
title: Mulliken charges:
elementType: O O O N C C C C C C C C C C C C C C C C C H H H H H H H H H H H H H
charge: -0.260484 -0.471100 -0.200329 -0.444144 0.529619 0.149950 -0.716460 0.284087 -0.616536 -0.353629 -0.403675 0.494856 0.136861 0.229302 -0.397973 -0.446001 -0.376353 -0.222984 -0.225838 0.115029 -0.246512 0.238913 0.228694 0.286518 0.253012 0.236146 0.355421 0.286894 0.233075 0.240800 0.226270 0.226681 0.229210 0.400681
chargesum: 0.00000
title: Mulliken charges with hydrogens summed into heavy atoms:
elementType: O O O N C C C C C C C C C C C C C C C C C
charge: -0.260484 -0.070419 -0.200329 -0.088723 0.529619 0.149950 -0.248853 0.284087 -0.330018 -0.100617 -0.167529 0.494856 0.136861 0.229302 -0.111079 -0.212926 -0.135553 0.003285 0.000843 0.115029 -0.017301
polarizability: 3.16169083e+02 -1.73254902e+01 1.89427072e+02 -1.96469544e+01 6.56374715e+00 1.28671607e+02
1716.lowfreq: -8.7407 -5.5906 -0.0006 -0.0004 0.0000 5.2240 17.1381 21.9164 34.9011
frequency: 17.0281 21.8257 34.8816 64.9753 77.2135 127.5389 137.8215 173.6055 187.1931 189.5554 210.4778 285.5913 318.9293 341.6217 360.5012 392.8333 403.5199 422.4505 463.7857 498.1683 505.4206 519.8808 539.1181 553.4148 582.7472 604.4907 605.0038 617.2660 639.5160 671.8095 692.7523 704.1822 720.1861 739.0414 753.8629 779.5477 800.3996 826.2636 835.0382 855.1854 898.3292 902.5168 913.7228 925.5510 937.4627 967.3169 973.8578 977.8693 990.5484 996.4047 1025.5262 1026.8568 1078.0795 1081.8281 1115.8519 1155.4718 1171.7880 1182.4247 1187.1530 1189.5993 1214.0713 1246.5698 1269.3496 1279.3716 1284.4638 1303.1966 1332.9706 1362.5258 1381.7516 1409.1106 1414.5321 1440.0064 1460.3829 1483.8800 1487.9608 1502.0149 1539.2511 1583.0544 1593.4180 1611.4124 1613.3880 1629.0453 1673.1759 2975.2209 3025.6307 3115.2219 3119.3160 3121.8426 3133.2270 3137.2887 3144.3701 3148.1070 3162.6948 3190.3122 3536.6919 3553.5154
redmass: 5.3138 3.9848 6.3096 9.1103 6.0188 6.5694 6.7695 5.5139 5.4789 4.9158 4.9834 5.4509 4.2362 3.0642 5.9018 6.7695 2.8067 3.4274 3.6242 3.0553 6.0804 8.1846 2.9137 6.0022 5.0543 2.5789 2.0537 6.2352 4.4299 1.6914 1.9771 2.1996 2.5263 7.5065 2.4868 3.4812 2.6307 2.9710 2.0828 1.2483 2.1384 1.5621 2.3022 4.7634 1.7564 1.7234 1.3686 1.3900 6.1878 1.3193 3.0320 2.2092 2.4219 1.5856 1.8146 1.3177 1.0597 1.1867 1.4631 1.5248 2.1734 1.7825 2.2892 2.7314 1.8929 1.7500 1.3093 2.3072 7.5874 4.5248 3.8435 2.0946 1.1637 2.3156 2.4844 5.2253 9.9682 4.0290 6.0373 8.2277 6.1348 6.7578 9.5384 1.0608 1.0994 1.0871 1.0868 1.0881 1.0911 1.0916 1.0959 1.0965 1.1015 1.0927 1.0776 1.0649
irintensity: 1.7545 0.2985 0.9438 0.0875 0.2555 0.8922 0.6765 0.9163 1.8349 1.0644 0.3958 5.1284 0.7438 1.5314 7.7015 1.7319 0.2491 0.1510 14.6499 24.0321 3.6120 9.8944 44.9043 2.1126 30.6081 68.3917 42.9160 0.4287 29.1042 30.6656 38.1817 37.5475 32.8711 23.1104 25.8816 0.3733 32.9063 15.6461 25.4276 0.0062 9.1669 35.8363 2.8441 99.0827 9.1359 6.6796 1.4759 0.2297 0.8636 0.3008 152.5542 10.1054 11.6611 16.0985 193.5169 7.2358 0.3593 3.0322 1.1735 0.6713 0.3302 6.2102 29.4976 35.9065 2.7751 21.8268 1.1869 32.5856 0.6430 39.6056 4.2500 6.1549 20.8514 29.5462 14.7095 187.7424 176.2256 49.9484 1.4840 170.7806 11.5472 7.9180 266.5191 22.6900 8.6407 8.5607 4.4970 8.0013 11.0096 4.5261 40.5653 13.9315 27.3994 2.1217 107.6739 77.6992
temp: 298.150 k
press: 1.00000 atm
elementType: 8 8 8 7 6 6 6 6 6 6 6 6 6 6 6 6 6 6 6 6 6 1 1 1 1 1 1 1 1 1 1 1 1 1
symmnumber: 1
zpe: 678588.5 jmol-1
zpe.correction: 0.258461 hartree
zpe.thermalcorrener: 0.275602 hartree
zpe.thermalcorrenthalpy: 0.276546 hartree
zpe.thermalcorrgfe: 0.210926 hartree
zpe.sumelectzpe: -934.616388 hartree
zpe.sumelectthermal: -934.599247 hartree
zpe.sumelectthermalent: -934.598303 hartree
zpe.sumelectthermalfe: -934.663923 hartree
dipole: 1.7931 -6.6552 -1.3858
dipole: 7.0305
quadrupole: -116.3490 -124.1148 -117.5914
quadrupole: 19.6830 1.7044 -1.8573
quadrupole: 3.0027 -4.7630 1.7603 19.6830 1.7044 -1.8573
hfenergy: -934.8748491 hartree
pointgroup: C01 [X(C17H13N1O3)]
dipole: 0.5696487 -2.2518692 1.5017708 debye
polarizability: 313.9838148|-30.6614534|167.3716748|2.9938413|-31.4718242|152.9122727 unknown
InChI: InChI=1S/C17H13NO3/c19-16-10-15(17(20)21)18-14-7-6-12(9-13(14)16)8-11-4-2-1-3-5-11/h1-7,9-10,18,20H,8H2
charge 0 multiplicity 1
34 atoms
O  -2.051194 2.458934 -2.053638
O  -5.148346 -1.43608 1.366007
O  -6.239766 0.340157 0.316179
N  -2.791449 -0.802073 0.42496
C  1.186658 -0.129533 -0.903996
C  -1.193376 0.523322 -0.858341
C  2.609976 0.07214 -1.422094
C  -1.478311 -0.587026 -0.004573
C  0.142183 0.727825 -1.291985
C  0.877622 -1.226285 -0.040811
C  -0.430122 -1.458983 0.402948
C  3.703241 -0.06745 -0.364556
C  -2.275556 1.453661 -1.293967
C  -3.826456 0.036997 0.03749
C  -3.611758 1.129098 -0.788265
C  4.749428 -1.010172 -0.522369
C  3.702385 0.758185 0.79048
C  5.774512 -1.126541 0.445615
C  4.724023 0.646632 1.758434
C  -5.18624 -0.28564 0.548321
C  5.765201 -0.29733 1.589708
H  2.671536 1.071848 -1.894188
H  2.803417 -0.660446 -2.23141
H  0.321545 1.588335 -1.947447
H  1.685131 -1.892072 0.284046
H  -0.649072 -2.306721 1.063306
H  -3.018426 -1.589376 1.037404
H  -4.455339 1.764173 -1.069078
H  4.764657 -1.654726 -1.410392
H  2.895823 1.488748 0.928569
H  6.576858 -1.859913 0.305848
H  4.711001 1.294944 2.642051
H  6.558739 -0.383293 2.340476
H  -6.06013 -1.642038 1.701464
