program: Gaussian 09
title: 000282687
version: EM64L-G09RevD.01
frameworkgroup: C1[X(C16H11ClN2O)]
method: RPBEPBE
basis: SDD
operation: Freq
keyword: #p
keyword: freq=noraman
keyword: PBEPBE/SDD
title: #p freq=noraman PBEPBE/SDD
converged: YES YES NO NO
title: Mulliken charges:
elementType: Cl O N N C C C C C C C C C C C C C C C C H H H H H H H H H H H
charge: -0.030267 -0.275603 -0.026779 -0.621464 -0.073647 0.427094 0.178764 -0.092552 0.367743 -0.403403 -0.386823 -0.321351 -0.302829 -0.354573 0.118602 -0.247249 -0.219221 -0.222601 -0.238612 -0.223469 0.295942 0.244562 0.265549 0.261654 0.233465 0.234675 0.259945 0.237011 0.237381 0.343871 0.334185
chargesum: 0.00000
title: Mulliken charges with hydrogens summed into heavy atoms:
elementType: Cl O N N C C C C C C C C C C C C C C C C
charge: -0.030267 -0.275603 -0.026779 0.056592 -0.073647 0.427094 0.178764 -0.092552 0.367743 -0.107462 -0.142260 -0.055802 -0.302829 -0.092919 0.118602 -0.013784 0.015454 0.037344 -0.001601 0.013912
polarizability: 3.08055671e+02 1.44195959e-01 1.96755290e+02 1.62417429e+01 1.44706160e+01 1.18420017e+02
1716.lowfreq: -6.8761 -4.7505 -0.0011 -0.0008 -0.0006 3.0264 28.9658 50.4568 56.2343
frequency: 28.9232 50.4292 56.2127 77.1694 93.5832 137.6038 145.0817 164.1655 228.1181 243.1629 264.3242 290.5424 329.5790 358.0396 374.2542 409.0648 416.8895 450.4153 483.1807 501.4622 531.4370 542.8375 556.7851 561.6575 586.9921 595.7473 614.6533 643.9232 670.9151 690.3265 717.6047 731.1979 757.9454 767.9494 770.8679 792.0325 809.3295 871.1836 882.6917 886.0351 953.7178 959.6053 974.7034 983.7331 989.0615 999.3553 1015.2369 1022.1410 1041.5612 1065.0047 1102.4202 1121.4573 1125.3867 1168.5143 1172.4966 1210.6769 1243.4634 1248.4739 1276.2467 1293.5525 1335.9692 1361.7496 1365.7860 1393.0427 1416.9741 1423.1632 1442.8804 1466.7174 1481.9988 1545.8002 1563.0804 1568.0901 1589.7335 1600.9039 1623.7495 1630.7547 3128.7082 3139.1688 3140.3603 3144.9250 3151.6595 3158.3423 3165.1531 3172.3934 3176.6427 3507.8741 3662.8305
redmass: 8.6492 5.5861 5.9416 6.0904 4.8325 6.4750 6.0602 6.1333 5.1501 5.7855 6.7192 5.1332 5.9942 4.6992 5.9298 5.8189 4.5889 3.4249 3.0005 3.4434 1.2748 4.2525 3.5975 6.1089 1.7762 2.8616 6.3219 5.5914 5.4938 4.6042 6.2330 3.9199 2.0412 2.1687 1.3771 4.1105 3.6080 1.4644 1.5537 4.9108 1.4016 1.4150 6.1344 1.4749 1.3444 1.3376 2.1899 5.8674 2.4380 1.8151 2.5434 1.6999 1.6324 1.1091 1.0580 1.7722 1.9101 1.7907 2.2434 2.5536 5.4060 8.3125 3.4379 2.7220 3.6267 3.2483 3.0583 3.0226 3.5253 7.2049 3.8569 5.2771 2.7688 7.0326 4.5646 2.5812 1.0865 1.0858 1.0900 1.0921 1.0905 1.0954 1.0954 1.0995 1.1003 1.0453 1.1043
irintensity: 0.7562 0.6062 5.5227 0.6606 5.6420 0.2938 0.7104 4.0202 6.2546 1.3825 0.6283 1.8481 0.7660 7.6260 0.5590 4.8018 4.2779 4.3930 11.0154 1.4367 103.7056 15.0059 15.8503 7.7943 70.3178 58.4062 6.9398 5.9591 17.1351 2.8248 11.2061 5.1137 31.3236 23.3451 107.7735 11.0703 13.2937 0.2867 2.7672 0.6525 2.8637 4.9648 17.0318 15.0685 0.3748 0.0029 6.8438 35.1852 5.8554 3.9291 1.8217 1.7372 7.7297 1.3118 0.6587 7.4735 2.9655 11.2179 43.1153 10.3251 70.1247 5.8428 110.2668 14.0342 17.1382 29.5336 20.1971 17.7589 31.6396 29.4122 84.7992 51.1285 35.6257 1.6740 26.9426 206.9959 0.6431 0.9237 9.9695 0.4414 9.3928 23.2056 8.6976 24.9788 15.4658 50.6731 59.6518
temp: 298.150 k
press: 1.00000 atm
elementType: 17 8 7 7 6 6 6 6 6 6 6 6 6 6 6 6 6 6 6 6 1 1 1 1 1 1 1 1 1 1 1
symmnumber: 1
zpe: 600582.6 jmol-1
zpe.correction: 0.228750 hartree
zpe.thermalcorrener: 0.244948 hartree
zpe.thermalcorrenthalpy: 0.245892 hartree
zpe.thermalcorrgfe: 0.184017 hartree
zpe.sumelectzpe: -1259.753844 hartree
zpe.sumelectthermal: -1259.737647 hartree
zpe.sumelectthermalent: -1259.736703 hartree
zpe.sumelectthermalfe: -1259.798578 hartree
dipole: -0.9133 -3.0667 -2.1648
dipole: 3.8633
quadrupole: -88.1340 -130.0827 -121.9850
quadrupole: 1.8197 6.2569 1.2328
quadrupole: 25.2665 -16.6821 -8.5844 1.8197 6.2569 1.2328
hfenergy: -1259.9825943 hartree
pointgroup: C01 [X(C16H11Cl1N2O1)]
dipole: -0.4143573 0.8409357 1.1963906 debye
polarizability: 308.5534007|7.2184328|179.0121467|-11.044882|35.8944231|135.66543 unknown
InChI: InChI=1S/C16H11ClN2O/c17-13-7-3-2-6-11(13)15-12(16(18)20)9-10-5-1-4-8-14(10)19-15/h1-9H,18H2
charge 0 multiplicity 1
31 atoms
Cl -2.015802 -0.365739 -2.33855
O  -0.16396 -3.639931 -0.7336
N  0.711752 1.015664 0.42865
N  -1.795939 -2.590903 0.522403
C  -0.157622 -0.001219 0.23492
C  2.593513 -0.511579 -0.083325
C  0.280935 -1.354075 -0.053983
C  2.071572 0.785166 0.291952
C  -1.598941 0.412721 0.337733
C  1.652862 -1.57146 -0.237195
C  4.006464 -0.678075 -0.250545
C  2.976474 1.872474 0.505977
C  -2.528934 0.318066 -0.727625
C  -2.050737 1.019375 1.541756
C  -0.582529 -2.598231 -0.13824
C  4.869124 0.400562 -0.042806
C  4.35099 1.680698 0.340679
C  -3.857826 0.770846 -0.608771
C  -3.378912 1.472525 1.686168
C  -4.286782 1.343532 0.609696
H  1.979258 -2.586706 -0.489032
H  4.398318 -1.660352 -0.539317
H  2.55498 2.84213 0.787638
H  -1.328372 1.14079 2.355294
H  5.949439 0.273538 -0.171348
H  5.043168 2.514759 0.499966
H  -4.539104 0.685288 -1.460164
H  -3.699945 1.931288 2.62687
H  -5.319155 1.695665 0.706405
H  -2.165661 -1.766825 0.994066
H  -2.362925 -3.43679 0.470034
