program: Gaussian 09
title: 000282659
version: EM64L-G09RevD.01
frameworkgroup: C1[X(C10H4Cl3NO2)]
method: RPBEPBE
basis: SDD
operation: Freq
keyword: #p
keyword: freq=noraman
keyword: PBEPBE/SDD
title: #p freq=noraman PBEPBE/SDD
converged: YES YES NO NO
title: Mulliken charges:
elementType: Cl Cl Cl O O N C C C C C C C C C C H H H H
charge: 0.002839 0.013093 0.021842 -0.163447 -0.163488 -0.386132 0.694853 -0.313090 -0.309357 0.161769 0.161748 -0.236621 -0.236622 -0.081480 -0.194201 -0.096326 0.279995 0.278835 0.278838 0.286953
chargesum: 0.00000
title: Mulliken charges with hydrogens summed into heavy atoms:
elementType: Cl Cl Cl O O N C C C C C C C C C C
charge: 0.002839 0.013093 0.021842 -0.163447 -0.163488 -0.386132 0.694853 -0.313090 -0.029363 0.161769 0.161748 0.042214 0.042216 -0.081480 0.092752 -0.096326
polarizability: 1.99377893e+02 -7.41576442e+00 1.27787519e+02 -7.31077405e-03 5.97149381e-02 1.09520793e+02
1716.lowfreq: -14.8823 -4.2458 -3.4810 -0.0013 0.0004 0.0016 9.7054 46.1917 62.3124
frequency: -14.4124 46.1871 62.3072 81.6128 124.5978 158.4694 169.8024 180.9226 226.6921 236.6310 289.1194 299.8609 314.4020 367.6213 391.1851 450.5924 473.2870 519.6131 545.9138 578.0650 617.5311 630.4237 641.3962 674.1479 679.7576 709.9271 735.0281 805.9335 828.8104 863.0010 883.6074 944.6291 959.3349 1011.9626 1038.0448 1070.7860 1096.9676 1116.8535 1201.1955 1232.8801 1287.0592 1309.6749 1356.3893 1377.3892 1458.5385 1557.3379 1584.6987 1587.6667 1638.3404 1686.6795 3178.0200 3183.5299 3206.4042 3234.2736
redmass: 13.0654 13.9052 7.2212 17.6240 11.8773 9.4499 18.7502 30.7239 6.3424 17.1792 4.2565 10.7988 27.0092 10.8049 13.3839 3.1877 11.0384 5.4965 5.0124 8.6085 8.1220 4.7236 3.3531 7.2257 6.5092 4.0059 6.9656 10.8557 2.0283 1.4830 1.4523 1.3134 6.6292 4.5215 2.5584 1.5323 5.7296 2.1894 4.3232 1.2029 1.7108 8.9163 7.7191 6.4005 4.1082 10.0440 7.0018 8.2115 11.9217 11.7599 1.0933 1.0935 1.0897 1.1105
irintensity: 0.0032 0.5177 1.5612 0.2527 8.0797 0.7531 0.3849 0.1609 0.0412 1.0865 0.0106 0.0385 0.1469 0.2644 18.1558 12.3081 8.0601 1.2949 2.7055 53.3545 0.7687 5.0776 2.4009 3.4588 28.8631 17.4405 0.5449 11.8119 73.1914 11.0495 10.0001 0.0080 48.1077 10.3770 63.9486 23.3060 70.9737 35.2793 84.5655 0.2751 1.7210 62.5770 11.6486 97.2896 319.7399 0.0226 5.1022 0.7509 440.4976 2.8689 0.8992 1.5233 0.0959 0.4745
temp: 298.150 k
press: 1.00000 atm
elementType: 17 17 17 8 8 7 6 6 6 6 6 6 6 6 6 6 1 1 1 1
symmnumber: 1
zpe: 304480.1 jmol-1
zpe.correction: 0.115970 hartree
zpe.thermalcorrener: 0.129246 hartree
zpe.thermalcorrenthalpy: 0.130190 hartree
zpe.thermalcorrgfe: 0.074568 hartree
zpe.sumelectzpe: -1967.719166 hartree
zpe.sumelectthermal: -1967.705890 hartree
zpe.sumelectthermalent: -1967.704946 hartree
zpe.sumelectthermalfe: -1967.760568 hartree
dipole: -2.6814 -0.4854 0.0002
dipole: 2.7250
quadrupole: -95.9994 -105.9994 -126.1500
quadrupole: 7.4628 0.0006 -0.0463
quadrupole: 13.3835 3.3836 -16.7671 7.4628 0.0006 -0.0463
hfenergy: -1967.8351359 hartree
pointgroup: C01 [X(C10H4Cl3N1O2)]
dipole: -1.0690832 -0.0801602 -0.001769 debye
dipolederiv: -0.3326811 0.3017061 0.008685 0.3220676 -0.5047198 -0.0139123 0.0093878 -0.0139804 -0.0208016 -0.2993986 0.2968736 0.0087163 0.368396 -0.510041 -0.0144489 0.0108355 -0.0145104 -0.0152117 -0.7658633 -0.0815394 -0.0020085 -0.12654 -0.069334 -0.0015179 -0.003268 -0.001539 -0.0137609 -0.4134322 -0.0081855 -0.2394872 -0.0230439 -0.2840522 0.0051904 0.2085508 0.0495274 -0.9731111 -0.4134123 -0.0212489 0.2383943 -0.0116529 -0.2831346 0.0320243 -0.209881 -0.0119757 -0.9740445 -1.3305022 -0.0896089 -0.0022039 -0.1035102 -0.2192528 0.0230481 -0.002866 0.0229665 -1.0704715 0.7951695 0.2045211 0.0054451 0.1577014 0.0457077 0.0019399 0.0040947 0.0019889 -0.0351201 0.402274 -0.5221406 -0.0150666 -0.4256162 0.7495224 0.0226554 -0.0126388 0.0229581 -0.0418609 -0.141365 0.1154825 0.0034837 0.0495065 -0.1579164 -0.0038508 0.0018092 -0.003783 -0.02732 0.9798342 0.0732558 0.0205992 0.0948741 0.2509797 -0.031313 -0.6723317 -0.1152006 1.4379729 0.9800512 0.0743162 -0.0164864 0.0590148 0.2465651 -0.0329797 0.6770209 0.0504337 1.4418864 -0.2259281 -0.0088782 -0.2453609 -0.0103854 -0.129918 -0.014526 -0.132887 -0.0095481 -0.0242653 -0.2257306 -0.0221362 0.2446763 -0.0177805 -0.1309407 0.0087636 0.1322117 0.0037885 -0.0234559 0.1295755 -0.6379095 -0.0186334 -0.5801158 0.7188039 0.0223386 -0.0169709 0.0225519 -0.0424284 -0.433445 0.1130459 0.0033653 0.1185482 -0.1791924 -0.004282 0.0034697 -0.0043155 -0.0316686 1.1235708 0.2873558 0.0078303 0.213014 0.0282496 0.0020089 0.005744 0.0018887 -0.0476952 0.0752199 -0.0290472 -0.0007976 -0.0433511 0.0340386 -0.0029106 -0.0011818 -0.003021 0.1381762 0.0115188 -0.0178529 0.0310436 -0.0129635 0.1758287 0.0044384 0.0493274 0.0068098 0.0792397 0.0114865 -0.0161376 -0.0319163 -0.0103947 0.1761393 0.0007922 -0.0499288 -0.0015646 0.0789514 0.0730579 -0.0118723 -0.0002782 -0.0177685 0.042667 -0.0034586 -0.0004976 -0.0034752 0.164989 unknown
polarizability: 197.0682529|-14.6552451|130.0750169|-0.4800277|0.6776409|109.5429348 unknown
InChI: InChI=1S/C10H4Cl3NO2/c11-5-3-7(13)8(4-6(5)12)14-9(15)1-2-10(14)16/h1-4H
charge 0 multiplicity 1
20 atoms
Cl -0.409598 2.742585 0.078331
Cl 3.352106 -2.458744 -0.072563
Cl 4.663364 0.55765 0.013679
O  -1.756504 -0.276083 2.350095
O  -1.757729 -0.149317 -2.359922
N  -1.350882 -0.187456 -0.004326
C  0.067623 -0.012551 -0.000124
C  0.649019 1.278135 0.035975
C  0.915415 -1.14065 -0.032741
C  -2.168999 -0.280606 1.169988
C  -2.1696 -0.217005 -1.181524
C  -3.585482 -0.387744 0.671216
C  -3.585817 -0.350957 -0.688591
C  2.313924 -0.983608 -0.029239
C  2.044329 1.44863 0.040062
C  2.876991 0.311252 0.007366
H  0.476053 -2.141236 -0.06089
H  -4.425615 -0.478115 1.359785
H  -4.426287 -0.403993 -1.380631
H  2.483189 2.44881 0.068153
