program: Gaussian 09
title: 000025236
version: EM64L-G09RevD.01
frameworkgroup: C1[X(C24H33NO2)]
method: RPBEPBE
basis: SDD
operation: Freq
keyword: #p
keyword: freq=noraman
keyword: PBEPBE/SDD
title: #p freq=noraman PBEPBE/SDD
converged: NO YES NO NO
title: Mulliken charges:
elementType: O O N C C C C C C C C C C C C C C C C C C C C C C C C H H H H H H H H H H H H H H H H H H H H H H H H H H H H H H H H H
charge: -0.254988 -0.222355 -0.085104 -0.008809 -0.333649 -0.413185 -0.386729 -0.370430 -0.390679 -0.735795 -0.357429 -0.336242 -0.694640 -0.695377 0.269973 0.131727 -0.361831 -0.342789 -0.002295 -0.230379 -0.256774 0.363172 -0.332495 -0.367703 -0.230795 -0.234431 -0.240984 0.167656 0.164602 0.206077 0.217671 0.222168 0.222695 0.188414 0.186521 0.204048 0.221357 0.225736 0.213261 0.260144 0.207076 0.197116 0.189689 0.192039 0.193288 0.216968 0.207890 0.210713 0.217478 0.211591 0.208915 0.254631 0.264117 0.227104 0.232647 0.239893 0.269456 0.223890 0.228292 0.227874
chargesum: 0.00000
title: Mulliken charges with hydrogens summed into heavy atoms:
elementType: O O N C C C C C C C C C C C C C C C C C C C C C C C C
charge: -0.254988 -0.222355 -0.085104 0.158847 0.037030 0.026654 0.024379 0.020139 0.056415 -0.055315 0.029376 0.049085 -0.059069 -0.057393 0.269973 0.131727 -0.107200 -0.078672 -0.002295 -0.003275 -0.024127 0.363172 -0.092602 -0.098248 -0.006905 -0.006139 -0.013111
polarizability: 3.23413297e+02 3.36340540e+01 2.88406537e+02 1.31701339e+01 -7.28309482e+00 2.07229928e+02
1716.lowfreq: -11.6494 -9.7704 -5.0028 -0.0004 -0.0002 0.0002 5.4346 14.6977 21.4052
frequency: -5.9700 11.0118 21.1918 30.9482 36.8030 40.9892 58.6537 65.0087 69.1639 74.8507 82.3123 91.9635 110.3605 118.7980 133.0191 147.0969 148.2626 171.5858 176.2041 186.4676 205.2772 226.7586 242.3412 250.0822 253.4791 269.7392 282.5252 315.4801 339.9331 355.9276 394.8777 401.9780 405.2556 425.0060 434.6316 445.8569 470.1714 487.2942 510.2307 530.6027 546.6689 582.7593 612.5466 623.2043 649.7990 686.6862 698.4676 709.5257 728.0587 739.1227 750.3818 753.8628 759.7765 785.2686 800.5426 805.2463 809.7318 854.9623 856.0633 881.1788 897.3721 899.8982 913.1950 924.3026 938.4674 942.4018 944.9563 949.3529 958.1658 980.6426 984.8325 985.1814 987.9672 989.9586 1000.4475 1024.5615 1030.0612 1047.4358 1059.5202 1062.0138 1082.1135 1082.6765 1091.5491 1099.9076 1107.7737 1111.3610 1131.3255 1139.6362 1154.8655 1171.6102 1174.3270 1181.7615 1185.8260 1190.1240 1218.4258 1224.7273 1237.7008 1242.9682 1255.7142 1257.9734 1275.6455 1283.0637 1289.8324 1292.6424 1295.9321 1307.6523 1317.8663 1328.7395 1331.7393 1338.4102 1342.8269 1348.9712 1363.3888 1376.8997 1383.9963 1387.7415 1388.3675 1390.2566 1393.6955 1429.0549 1435.1165 1459.0116 1465.2404 1468.3283 1469.4174 1472.8599 1474.4471 1476.3199 1476.6273 1479.5324 1479.6292 1483.7691 1486.0848 1491.7407 1493.2980 1505.9353 1536.2003 1581.0969 1590.7117 1602.6607 1609.4771 2789.5979 2821.5193 2956.3368 2962.5500 2963.5359 2968.6677 2971.6638 2972.1523 2973.0192 2993.9168 2996.7434 2999.8654 3005.7267 3019.6284 3024.6845 3032.3161 3048.5006 3053.0969 3068.0300 3069.4445 3070.3828 3072.6106 3086.1043 3112.5085 3120.5622 3132.0803 3132.2743 3143.8912 3147.1864 3154.6537 3161.5330 3165.1651 3172.1257
redmass: 4.3805 4.3761 4.0391 4.3250 4.3136 4.5411 2.0969 1.7604 3.6617 3.9364 2.3372 3.8566 3.1472 2.6037 4.4620 2.6575 2.4278 3.4576 3.8629 1.7975 2.9221 1.1041 2.0787 1.2957 5.5002 2.5855 5.4574 2.8914 4.0692 4.0983 3.6138 2.7780 3.2235 2.4940 3.9705 2.6198 4.0335 2.5104 3.6609 3.9971 3.9852 4.8285 6.4523 5.8435 4.2429 4.2234 1.7075 4.1185 1.1185 1.3345 1.7298 2.8142 1.3667 1.2008 2.8788 1.2722 3.4387 1.5339 1.2479 2.8036 1.7468 1.7148 4.5186 1.3079 2.1489 1.4200 1.3663 1.5390 1.8351 1.3409 2.4531 1.7046 2.2424 6.0747 1.3350 2.2259 2.4780 2.1689 2.4875 2.3305 1.6439 2.1500 2.1481 2.4795 2.2348 2.0456 1.7812 2.0992 2.1629 1.0580 1.0824 2.3056 1.1362 1.9345 3.3173 1.3606 1.1849 1.4364 1.9832 1.3084 1.3213 1.1044 1.1829 1.0874 2.0786 1.2182 1.3545 1.4058 1.5879 1.4583 1.5368 1.4264 1.5807 1.8915 1.9475 3.1019 1.6785 1.2135 1.2939 2.2649 2.2993 1.2830 1.0716 1.0838 1.0931 1.2566 1.0672 1.0681 1.8138 1.5038 1.0543 1.0637 1.0825 1.0729 1.0838 1.0816 10.3824 6.9851 6.3909 6.2357 6.0917 1.0785 1.0720 1.0585 1.0585 1.0596 1.0564 1.0376 1.0466 1.0478 1.0935 1.0392 1.0631 1.0985 1.1017 1.1050 1.0946 1.0971 1.0982 1.1005 1.1007 1.0996 1.0993 1.0970 1.1009 1.0847 1.0859 1.0881 1.0926 1.0898 1.0964 1.0937 1.1005 1.0999
irintensity: 0.1309 0.3033 0.0746 0.8309 1.1568 0.9506 0.3242 0.1927 1.7742 0.6894 0.0702 0.6331 1.1212 0.1875 1.1234 0.4864 0.4970 0.3165 1.9523 0.2239 1.3097 0.0147 0.9776 0.1859 3.2780 1.0803 0.2530 1.5676 0.6041 2.5726 0.7681 1.7350 2.7821 3.0277 1.9129 3.2277 3.5566 1.5724 6.7117 2.8051 7.0465 0.9662 0.0265 12.8883 19.2384 0.9740 82.5029 16.4859 12.5314 0.2104 16.6390 42.4939 55.0661 1.2115 4.4343 0.7260 19.9547 0.0931 1.1748 7.7903 15.1466 5.3140 39.6488 13.9624 21.6190 1.1312 10.2932 15.5643 54.0870 1.4596 15.0575 3.7421 7.2414 0.7702 1.1418 2.4994 0.8257 15.1382 5.8549 4.2018 7.6142 7.9077 5.2141 41.4156 8.5714 16.1184 0.8239 19.5078 11.8521 0.1903 14.3539 17.5240 13.3247 10.1194 200.2848 2.6642 14.3904 3.8074 58.6550 3.6510 2.0312 8.5107 0.6048 2.2551 200.5306 9.9709 16.2404 15.3609 4.9434 5.6611 5.1914 7.9603 8.0693 17.5944 13.6861 11.6803 6.3796 12.4862 4.2835 39.4464 60.4097 53.3405 1.2578 1.1090 10.6116 18.0142 3.9664 14.9383 0.5854 7.1872 15.5048 4.6616 12.1189 12.1986 18.3585 11.9008 143.0111 25.0617 12.8592 112.2699 7.4671 77.8744 131.9899 1.9881 15.5256 39.0599 57.5776 46.5198 24.1598 54.4892 3.7363 31.0300 41.4337 3.2312 19.6668 46.6135 11.3932 43.4731 40.5354 68.6376 106.3537 56.0232 52.8717 41.7311 24.0980 0.0205 4.4615 6.3309 24.0201 7.1396 22.0866 21.0597 21.0520 19.2753
temp: 298.150 k
press: 1.00000 atm
elementType: 8 8 7 6 6 6 6 6 6 6 6 6 6 6 6 6 6 6 6 6 6 6 6 6 6 6 6 1 1 1 1 1 1 1 1 1 1 1 1 1 1 1 1 1 1 1 1 1 1 1 1 1 1 1 1 1 1 1 1 1
symmnumber: 1
zpe: 1347505.9 jmol-1
zpe.correction: 0.513238 hartree
zpe.thermalcorrener: 0.541215 hartree
zpe.thermalcorrenthalpy: 0.542159 hartree
zpe.thermalcorrgfe: 0.451825 hartree
zpe.sumelectzpe: -1137.472061 hartree
zpe.sumelectthermal: -1137.444084 hartree
zpe.sumelectthermalent: -1137.443140 hartree
zpe.sumelectthermalfe: -1137.533474 hartree
dipole: -3.5848 3.9419 -0.7788
dipole: 5.3848
quadrupole: -166.6626 -158.2908 -162.0557
quadrupole: 16.6556 -4.2324 3.3142
quadrupole: -4.3262 4.0456 0.2807 16.6556 -4.2324 3.3142
hfenergy: -1137.9852991 hartree
pointgroup: C01 [X(C24H33N1O2)]
dipole: 1.3776734 1.4945693 0.5970416 debye
polarizability: 324.5013741|-34.9582962|281.9136578|7.7151418|20.9884819|212.6347293 unknown
InChI: InChI=1S/C24H33NO2/c1-4-6-17-25(18-7-5-2)20(3)19-27-23-16-12-11-15-22(23)24(26)21-13-9-8-10-14-21/h8-16,20H,4-7,17-19H2,1-3H3
charge 0 multiplicity 1
60 atoms
O  -1.210102 0.790918 -0.671177
O  -3.593278 -2.319626 -1.061142
N  1.779428 0.706377 -0.679889
C  0.937011 1.497127 -1.621368
C  3.097802 0.333048 -1.256949
C  1.85187 1.217666 0.710667
C  3.893974 -0.67416 -0.40015
C  2.545584 2.59563 0.921708
C  -0.387841 1.969564 -0.995591
C  0.632148 0.706587 -2.918541
C  5.089713 -1.273105 -1.177256
C  2.594474 2.998001 2.413141
C  5.938692 -2.233432 -0.316722
C  3.290638 4.355627 2.651462
C  -2.511888 1.001421 -0.205786
C  -3.32281 -0.164084 -0.048001
C  -3.052275 2.286431 0.058476
C  -4.679121 -0.000076 0.327172
C  -2.84969 -1.562918 -0.359823
C  -4.396702 2.414587 0.470458
C  -5.219538 1.273583 0.601878
C  -1.568075 -2.086915 0.214701
C  -0.979284 -1.520294 1.374304
C  -0.979491 -3.237692 -0.374131
C  0.176185 -2.098138 1.939869
C  0.186323 -3.802819 0.178834
C  0.765633 -3.235627 1.340279
H  1.452292 2.453645 -1.918924
H  3.741708 1.230303 -1.459407
H  2.912557 -0.144051 -2.235142
H  2.382612 0.460565 1.316191
H  0.827653 1.25014 1.126835
H  3.206624 -1.483964 -0.083704
H  4.279015 -0.193274 0.521504
H  2.015271 3.385684 0.349754
H  3.578512 2.559524 0.519031
H  -0.921376 2.59569 -1.73997
H  -0.226395 2.575585 -0.082943
H  1.526011 0.580661 -3.551835
H  0.229372 -0.286756 -2.661073
H  -0.121914 1.244953 -3.521454
H  4.711652 -1.811986 -2.06965
H  5.731646 -0.45144 -1.557223
H  1.561375 3.03565 2.817172
H  3.12082 2.206757 2.9860
H  6.782679 -2.655037 -0.892983
H  6.35795 -1.711496 0.564349
H  5.326402 -3.07718 0.053818
H  3.310303 4.618801 3.725198
H  4.335741 4.333045 2.289459
H  2.768115 5.169292 2.113614
H  -2.440965 3.184688 -0.064896
H  -5.301576 -0.898408 0.396241
H  -4.801455 3.412066 0.675818
H  -6.265565 1.375041 0.907484
H  -1.437804 -0.640911 1.839647
H  -1.45941 -3.673196 -1.256947
H  0.617596 -1.665144 2.844613
H  0.641043 -4.685142 -0.285292
H  1.666331 -3.681886 1.777893
