program: Gaussian 09
title: 000282673
version: EM64L-G09RevD.01
frameworkgroup: C1[X(C18H17NO3)]
method: RPBEPBE
basis: SDD
operation: Freq
keyword: #p
keyword: freq=noraman
keyword: PBEPBE/SDD
title: #p freq=noraman PBEPBE/SDD
converged: YES YES NO NO
title: Mulliken charges:
elementType: O O O N C C C C C C C C C C C C C C C C C C H H H H H H H H H H H H H H H H H
charge: -0.293406 -0.270257 -0.260352 -0.058453 0.548071 0.369991 -0.457159 -0.403236 0.211323 0.246073 -0.456904 0.179356 -0.350692 -0.375724 -0.363053 0.317847 -0.372109 -0.367575 -0.310163 -0.538308 -0.500125 -0.537267 0.262584 0.218794 0.230900 0.255533 0.222650 0.247774 0.251280 0.242916 0.235167 0.239276 0.239874 0.228340 0.252579 0.219971 0.223932 0.223706 0.246844
chargesum: 0.00000
title: Mulliken charges with hydrogens summed into heavy atoms:
elementType: O O O N C C C C C C C C C C C C C C C C C C
charge: -0.293406 -0.270257 -0.260352 -0.058453 0.548071 0.369991 -0.194575 -0.184441 0.211323 0.246073 -0.226004 0.179356 -0.095160 -0.153074 -0.115279 0.317847 -0.120829 -0.124659 -0.310163 0.176010 0.200765 0.157215
polarizability: 5.06595770e+02 2.24019319e+01 2.23773193e+02 -3.16003198e-01 -1.89943811e+00 9.95209321e+01
1716.lowfreq: -3.5581 -0.0010 -0.0005 -0.0002 2.7508 6.6512 18.8401 24.9904 34.8356
frequency: 18.7816 24.9838 34.8253 52.5032 55.9390 77.2273 98.0881 115.9116 121.2755 140.8493 147.4606 173.3159 188.7697 202.0244 215.3134 234.9156 252.3258 270.2314 289.5965 311.0385 344.9802 361.6891 370.3193 401.2330 412.2527 415.3303 458.5091 479.8659 503.0992 517.8620 543.2830 560.8768 598.7424 614.8381 633.0777 652.4050 707.6280 727.4319 735.6708 740.0871 762.5088 792.6172 813.1946 816.8417 835.0181 868.8299 914.8964 918.8043 947.2672 951.1959 961.5437 962.1268 981.4893 986.5763 999.8506 1019.7318 1107.9516 1108.2825 1113.1636 1118.2521 1123.7960 1152.5285 1154.7911 1159.4698 1168.4651 1186.5519 1222.5280 1242.3003 1257.9191 1275.1516 1292.5987 1313.7451 1333.3525 1377.7099 1396.0725 1421.1463 1431.0413 1435.8099 1437.7011 1449.1980 1454.6481 1466.4540 1467.9196 1468.0432 1471.9794 1473.4244 1496.0645 1506.6725 1560.8690 1571.9317 1581.2558 1610.1186 1621.7334 2143.1515 2963.3020 2972.7526 2993.8044 3052.5648 3065.6111 3103.7037 3113.3670 3128.3729 3129.3714 3132.5473 3133.5775 3137.0249 3141.2581 3164.7571 3169.8681 3170.1634 3204.9302
redmass: 3.7458 5.1043 3.7439 3.8430 4.6064 3.7337 3.3555 3.1496 3.5610 2.7058 6.8630 2.3734 4.1217 2.2977 2.2567 1.3012 4.6100 2.1356 2.4941 3.6518 4.4980 5.9149 6.2946 4.5342 3.8004 4.4229 3.2082 4.8701 4.4970 2.8933 6.3238 5.4241 6.3529 4.1371 6.9852 4.7813 6.3686 3.4786 3.6734 4.9681 5.8774 6.3099 1.3004 1.3724 1.7139 1.5233 3.0284 1.9627 1.3861 1.4386 1.3726 8.1722 7.2505 7.7191 2.9929 2.6977 1.2625 1.2610 1.2595 1.9433 1.3841 1.3331 1.6256 1.3239 1.8806 1.3446 2.1289 2.4033 3.1528 2.5364 1.9119 1.3147 2.3857 5.4516 3.0010 1.9039 3.4599 1.2721 1.1714 1.5680 1.0739 1.0538 1.0498 1.0491 1.0975 1.0769 2.4500 2.5196 7.3375 5.9778 6.1380 6.1880 6.2203 12.6223 1.0328 1.0321 1.0315 1.1041 1.1045 1.1007 1.0871 1.0996 1.1010 1.0893 1.1057 1.0887 1.0873 1.0943 1.0960 1.0952 1.0891
irintensity: 0.2382 2.9180 1.7974 8.5547 2.5424 1.6468 6.7675 7.2204 3.9233 2.8777 3.8190 2.6034 2.9299 1.4917 1.9413 0.9370 0.2740 0.3907 0.5363 12.1039 2.6395 4.2434 4.0060 0.1711 7.4396 9.1630 2.4946 19.8461 10.0159 19.5333 2.9318 36.0090 6.8259 21.8930 1.5416 0.8948 11.8801 1.8381 2.0199 6.4170 2.1760 4.6368 0.9049 21.6728 89.3427 15.5620 11.4062 19.7007 0.2735 3.4293 0.6947 61.3291 76.6159 27.4711 26.2362 15.7137 2.9637 0.0984 0.2044 99.4339 12.9432 2.7236 52.7840 2.1892 32.7783 223.1102 44.5320 215.0885 102.4556 262.5143 221.0187 17.2623 20.3228 50.2117 101.8323 17.2574 13.6518 3.9039 11.6173 22.8850 12.2509 39.2412 13.4780 22.7670 111.3243 45.2662 24.3701 289.0446 72.7043 3.2516 76.3404 35.9810 175.7252 72.7386 98.2561 31.5493 111.0226 46.3011 33.3906 41.4053 17.0012 31.9189 27.5120 8.9701 20.4406 4.7884 7.2445 16.8294 9.9102 10.1690 5.9217
temp: 298.150 k
press: 1.00000 atm
elementType: 8 8 8 7 6 6 6 6 6 6 6 6 6 6 6 6 6 6 6 6 6 6 1 1 1 1 1 1 1 1 1 1 1 1 1 1 1 1 1
symmnumber: 1
zpe: 797238.2 jmol-1
zpe.correction: 0.303652 hartree
zpe.thermalcorrener: 0.325128 hartree
zpe.thermalcorrenthalpy: 0.326072 hartree
zpe.thermalcorrgfe: 0.251118 hartree
zpe.sumelectzpe: -974.897720 hartree
zpe.sumelectthermal: -974.876245 hartree
zpe.sumelectthermalent: -974.875301 hartree
zpe.sumelectthermalfe: -974.950254 hartree
dipole: 0.8432 0.1315 0.5327
dipole: 1.0060
quadrupole: -92.2378 -124.8225 -133.9792
quadrupole: 0.2992 -8.6857 -1.9280
quadrupole: 24.7753 -7.8093 -16.9660 0.2992 -8.6857 -1.9280
hfenergy: -975.2013724 hartree
pointgroup: C01 [X(C18H17N1O3)]
dipole: -0.3267384 0.0393631 -0.2198961 debye
polarizability: 503.5204289|-36.0065524|224.9175623|8.4070454|-15.5196518|101.4519042 unknown
InChI: InChI=1S/C18H17NO3/c1-20-16-7-5-14(6-8-16)15(12-19)10-13-4-9-17(21-2)18(11-13)22-3/h4-11H,1-3H3
charge 0 multiplicity 1
39 atoms
O  4.682402 1.249553 0.106029
O  5.718994 -1.401458 0.674237
O  -6.533565 -0.341106 0.081816
N  0.026234 2.808912 -0.236208
C  1.508635 -0.774901 0.432995
C  -2.309278 0.180669 0.124253
C  2.390053 0.324782 0.204367
C  0.050907 -0.707874 0.389223
C  3.787965 0.178478 0.272174
C  -0.827124 0.342887 0.153973
C  2.096412 -2.040267 0.735314
C  4.361723 -1.108567 0.54811
C  3.489373 -2.197482 0.786572
C  -2.930497 -1.100078 0.016491
C  -3.161363 1.315398 0.198325
C  -5.155864 -0.089452 0.099933
C  -4.325495 -1.2370 0.00867
C  -4.566366 1.195002 0.1894
C  -0.345553 1.682966 -0.058884
C  4.108192 2.579322 -0.143928
C  6.739808 -0.646852 -0.0826
C  -7.433794 0.813021 0.164229
H  1.975514 1.309074 -0.012392
H  -0.427637 -1.675706 0.589977
H  1.449265 -2.905195 0.92121
H  3.946514 -3.166544 1.007224
H  -2.322228 -2.004508 -0.088186
H  -2.720858 2.316056 0.272043
H  -4.799075 -2.219276 -0.080983
H  -5.18014 2.098267 0.252362
H  3.531003 2.598021 -1.0875
H  4.975124 3.251523 -0.221614
H  3.457498 2.897696 0.691927
H  7.660279 -1.237069 0.045356
H  6.862365 0.369288 0.32068
H  6.469807 -0.588862 -1.152533
H  -7.288673 1.497381 -0.69397
H  -7.288677 1.367839 1.111324
H  -8.447783 0.388666 0.133685
