program: Gaussian 09
title: 000282650
version: EM64L-G09RevD.01
frameworkgroup: C1[X(C13H11NO2S)]
method: RPBEPBE
basis: SDD
operation: Freq
keyword: #p
keyword: freq=noraman
keyword: PBEPBE/SDD
title: #p freq=noraman PBEPBE/SDD
converged: YES YES NO NO
title: Mulliken charges:
elementType: S O O N C C C C C C C C C C C C C H H H H H H H H H H H
charge: 0.229407 -0.211262 -0.205175 0.011085 0.398964 0.331167 -0.382527 -0.401953 -0.387511 0.473533 -0.369518 -0.377497 -0.382134 -0.234725 -0.233234 -0.233422 -0.837403 0.275518 0.251878 0.283133 0.243116 0.238486 0.232384 0.231613 0.235661 0.306966 0.258561 0.254890
chargesum: 0.00000
title: Mulliken charges with hydrogens summed into heavy atoms:
elementType: S O O N C C C C C C C C C C C C C
charge: 0.229407 -0.211262 -0.205175 0.011085 0.398964 0.331167 -0.107009 -0.401953 -0.135633 0.473533 -0.086386 -0.134381 -0.143648 -0.002341 -0.001621 0.002239 -0.016987
polarizability: 3.02391412e+02 -2.25668218e+00 1.82173111e+02 1.44264594e-01 -9.76080074e+00 9.61170117e+01
1716.lowfreq: -6.4538 -2.7765 -0.0014 -0.0010 -0.0009 10.1354 33.9554 48.2159 56.6078
frequency: 33.9256 48.1782 56.6050 87.6041 98.2517 131.2452 146.2571 185.1018 190.7966 233.2723 243.1779 257.5995 295.0845 371.2358 403.8938 410.3476 447.6050 479.6267 492.2715 550.5964 604.2036 615.2787 632.0987 643.1256 667.8714 672.3044 700.2530 740.1271 743.4472 773.7939 823.1196 850.1701 853.5624 912.5721 928.2400 972.4937 976.5197 979.9471 989.5419 997.1164 999.1453 1012.4922 1025.5525 1045.0882 1088.8783 1118.2426 1161.2898 1176.5886 1197.6076 1209.6024 1259.3670 1293.8653 1313.4720 1324.5120 1350.1650 1368.3303 1377.1981 1391.6167 1438.8107 1440.4659 1451.3630 1471.8423 1495.1180 1552.5274 1585.9456 1596.3897 1612.4005 3016.1475 3128.2217 3132.1249 3136.6295 3144.0201 3152.2872 3154.6479 3158.5356 3159.8685 3169.3023 3179.9690
redmass: 6.6297 4.3789 6.1195 4.9011 4.0119 4.6640 1.0504 14.1080 4.4242 5.2378 6.3378 6.7781 6.1356 8.4479 2.8472 4.3835 4.1923 7.2263 4.2394 5.0020 5.3203 6.4943 7.4473 7.1005 4.3565 7.0480 1.7491 3.9098 9.1879 1.9095 6.8441 1.2575 1.5087 1.3943 1.4879 1.1708 1.4634 1.3971 4.5618 1.2853 1.3244 5.0855 4.2069 2.0860 1.6205 2.4377 1.5357 1.0557 1.2807 4.9223 1.4401 2.5353 1.5343 1.2413 2.3052 6.9911 6.5488 5.6213 1.3173 1.6817 2.3970 1.0582 2.6635 6.6386 6.0851 6.3345 6.0096 1.0277 1.0849 1.0876 1.1040 1.0920 1.0928 1.0927 1.0917 1.1054 1.1016 1.0956
irintensity: 0.4678 0.5740 0.2828 1.0648 1.5745 2.1911 0.0037 0.3917 3.0098 0.6525 0.2823 0.6361 0.3295 0.3142 0.5852 1.8342 4.2727 6.0527 3.5574 6.1224 5.1207 0.4049 0.2779 1.0895 6.9805 4.2759 48.3599 13.0036 17.7239 66.1711 14.1227 2.1716 27.9694 10.8453 1.3574 17.1874 2.0396 2.4797 0.5527 17.6538 0.0753 6.3996 4.4827 4.6357 7.9797 8.8317 14.3896 0.1614 88.4495 374.4195 3.2459 3.1471 2.6227 15.2651 14.3368 48.7092 36.5712 32.2782 11.2162 9.3622 35.6155 16.9825 6.1385 20.1722 9.3962 139.2616 0.0832 33.3304 5.0317 0.1406 10.0228 13.0089 8.3082 26.3472 1.9634 3.5473 26.8894 2.7505
temp: 298.150 k
press: 1.00000 atm
elementType: 16 8 8 7 6 6 6 6 6 6 6 6 6 6 6 6 6 1 1 1 1 1 1 1 1 1 1 1
symmnumber: 1
zpe: 545067.0 jmol-1
zpe.correction: 0.207605 hartree
zpe.thermalcorrener: 0.222836 hartree
zpe.thermalcorrenthalpy: 0.223780 hartree
zpe.thermalcorrgfe: 0.163747 hartree
zpe.sumelectzpe: -1103.959606 hartree
zpe.sumelectthermal: -1103.944374 hartree
zpe.sumelectthermalent: -1103.943430 hartree
zpe.sumelectthermalfe: -1104.003463 hartree
dipole: -5.8969 1.1837 1.8706
dipole: 6.2987
quadrupole: -111.2067 -101.0497 -106.2877
quadrupole: 9.1889 5.1411 -3.2306
quadrupole: -5.0253 5.1317 -0.1063 9.1889 5.1411 -3.2306
hfenergy: -1104.1672106 hartree
pointgroup: C01 [X(C13H11N1O2S1)]
dipole: -2.3972289 -0.4660982 -0.420674 debye
polarizability: 300.5788584|-16.2840855|156.7874633|-6.9591325|-40.6390164|123.315213 unknown
InChI: InChI=1S/C13H11NO2S/c1-17-13-9-11(7-8-12(13)14(15)16)10-5-3-2-4-6-10/h2-9H,1H3
charge 0 multiplicity 1
28 atoms
S  2.270841 -2.056987 1.311119
O  3.936307 1.740503 -0.618675
O  4.251479 -0.498013 -0.330288
N  3.489346 0.538883 -0.430213
C  -0.81262 0.275185 -0.134993
C  -2.296533 0.217263 -0.0308
C  0.000916 -0.727772 0.457918
C  1.413322 -0.723249 0.370501
C  -0.162007 1.330067 -0.834241
C  2.025625 0.363199 -0.321216
C  1.236337 1.378135 -0.915565
C  -2.927512 -0.347282 1.112739
C  -3.120479 0.727509 -1.072752
C  -4.33334 -0.398711 1.211649
C  -4.526493 0.673639 -0.975403
C  -5.140327 0.11081 0.167737
C  2.911947 -3.180069 -0.068063
H  -0.467003 -1.568786 0.978368
H  -0.751878 2.1359 -1.281919
H  1.749269 2.203573 -1.41638
H  -2.31673 -0.717002 1.943838
H  -2.660888 1.137444 -1.979164
H  -4.799086 -0.827735 2.105464
H  -5.142661 1.062326 -1.793489
H  -6.232265 0.070017 0.244102
H  3.67536 -2.63935 -0.642147
H  2.073056 -3.503074 -0.702368
H  3.352716 -4.04822 0.447141
