program: Gaussian 09
title: 000282648
version: EM64L-G09RevD.01
frameworkgroup: C1[X(C15H12BrNO2)]
method: RPBEPBE
basis: SDD
operation: Freq
keyword: #p
keyword: freq=noraman
keyword: PBEPBE/SDD
title: #p freq=noraman PBEPBE/SDD
converged: NO YES NO NO
title: Mulliken charges:
elementType: Br O O N C C C C C C C C C C C C C C C H H H H H H H H H H H H
charge: -0.012922 -0.402812 -0.235577 -0.447399 -0.700254 0.326039 0.177137 0.261586 0.215123 -0.603297 -0.380496 0.506924 -0.371771 -0.398582 -0.457707 -0.218100 -0.191303 -0.420453 0.165821 0.246174 0.246194 0.246279 0.236725 0.259021 0.242988 0.223160 0.245930 0.333753 0.257253 0.257816 0.392750
chargesum: 0.00000
title: Mulliken charges with hydrogens summed into heavy atoms:
elementType: Br O O N C C C C C C C C C C C C C C C
charge: -0.012922 -0.010062 -0.235577 -0.113646 -0.207886 0.326039 0.177137 0.261586 0.215123 -0.357018 -0.143770 0.506924 -0.112750 -0.155594 -0.234548 -0.218100 0.054627 0.094617 0.165821
polarizability: 3.86722134e+02 -6.34464940e+00 1.81791465e+02 -5.86973127e-02 -7.57629802e-02 7.89611973e+01
1716.lowfreq: -2.0172 -0.0009 -0.0006 -0.0004 3.2666 9.1190 22.7012 50.7915 54.9296
frequency: 22.6257 50.7667 54.9296 58.2857 104.7590 127.5071 148.4073 162.9456 165.1580 218.5234 233.2822 243.0042 282.9593 341.2038 366.3401 421.7055 436.0624 447.8100 476.9749 478.8833 516.1589 523.5868 530.2392 554.1853 570.0001 589.7421 626.9441 637.2355 663.2114 702.9534 730.5349 753.4898 765.6275 815.7627 828.9368 840.3613 843.0971 876.4314 877.1105 945.5858 946.1576 949.3712 961.1000 991.5242 1006.5114 1055.0401 1058.2477 1106.3479 1133.0880 1133.7860 1135.4380 1176.5198 1184.1414 1201.6352 1202.9468 1236.8461 1264.9482 1280.6121 1289.2909 1314.3377 1364.7261 1373.6941 1383.7884 1413.4069 1427.1073 1448.3928 1465.1712 1469.6643 1497.5646 1508.1975 1576.4163 1588.2760 1608.8092 1637.7852 1670.2809 2933.1423 2964.9934 2983.7529 3028.3748 3118.2903 3135.7390 3137.0048 3144.2552 3152.5265 3167.8248 3524.2115 3537.1743
redmass: 7.0801 7.7131 8.7669 8.0095 3.8668 7.4915 3.1175 12.9273 4.2068 7.6205 2.2201 4.9821 8.4262 5.6988 5.3528 2.6575 2.8844 7.1239 4.0171 1.2724 2.2288 2.0213 4.1471 5.0991 5.7983 2.9312 6.4439 1.4439 6.8874 3.2040 5.7400 3.0260 5.4511 1.4170 1.6132 5.2413 1.5222 3.8188 1.3988 1.4558 2.9629 1.4716 1.8589 6.5730 1.9189 2.0994 2.4890 2.4057 1.1442 1.7039 2.2379 1.9191 2.0704 1.6665 1.0816 1.6110 1.4900 1.4405 1.5577 2.6823 3.0116 5.3150 2.6565 3.2122 1.2341 2.1234 4.6572 1.2301 1.8924 4.1801 7.8142 6.2320 7.4800 7.0807 8.0668 1.0582 1.0997 1.0607 1.0995 1.0872 1.0910 1.0893 1.0964 1.0928 1.0959 1.0643 1.0769
irintensity: 0.0003 0.3994 0.8693 0.2083 0.5802 1.5180 4.1413 1.0203 0.5105 8.2060 9.1334 4.2614 8.9533 3.2416 1.4162 16.5071 1.8800 2.6119 24.1122 99.4196 2.5776 5.4439 6.5018 31.8236 14.3506 0.0032 5.0985 159.4143 5.6850 9.0838 8.0629 0.6950 5.1377 94.5946 7.1049 30.4077 28.3359 2.7198 1.0740 3.3751 10.3726 1.8029 12.5968 12.7044 0.6911 67.1636 345.6967 47.4287 0.0081 21.0025 9.8978 11.6721 3.5963 1.7397 0.0986 19.4941 20.6122 2.5078 19.7729 13.4002 100.3832 15.6074 71.7994 48.9370 19.8452 71.2074 87.9037 51.7579 71.8786 244.5454 8.1579 63.8423 1.3526 374.9784 201.9360 112.8258 20.5158 14.1988 7.3985 15.4757 28.2579 7.0126 21.2286 4.2352 8.7036 56.1249 168.2080
temp: 298.150 k
press: 1.00000 atm
elementType: 35 8 8 7 6 6 6 6 6 6 6 6 6 6 6 6 6 6 6 1 1 1 1 1 1 1 1 1 1 1 1
symmnumber: 1
zpe: 609627.7 jmol-1
zpe.correction: 0.232195 hartree
zpe.thermalcorrener: 0.248669 hartree
zpe.thermalcorrenthalpy: 0.249613 hartree
zpe.thermalcorrgfe: 0.185955 hartree
zpe.sumelectzpe: -796.155908 hartree
zpe.sumelectthermal: -796.139434 hartree
zpe.sumelectthermalent: -796.138490 hartree
zpe.sumelectthermalfe: -796.202148 hartree
dipole: -5.2348 -1.4445 0.0078
dipole: 5.4305
quadrupole: -110.3730 -107.9549 -124.4934
quadrupole: 14.1601 -0.0067 -0.0408
quadrupole: 3.9008 6.3189 -10.2197 14.1601 -0.0067 -0.0408
hfenergy: -796.3881032 hartree
pointgroup: C01 [X(C15H12Br1N1O2)]
dipole: 2.0860228 0.4617262 0.0034898 debye
polarizability: 385.5301087|-16.8257728|182.9822271|-0.112006|0.371046|78.9624608 unknown
InChI: InChI=1S/C15H12BrNO2/c16-11-1-3-13-9(6-11)5-10-7-12(2-4-14(10)13)17-8-15(18)19/h1-4,6-7,17-18H,5,8H2
charge 0 multiplicity 1
31 atoms
Br -6.761716 1.060983 0.00473
O  6.420726 1.580739 -0.010333
O  6.157397 -0.732542 -0.001343
N  3.416635 -0.497557 -0.000161
C  -1.220628 1.628142 0.008965
C  -0.171992 0.519206 0.004174
C  -0.813439 -0.754839 -0.001896
C  -2.534672 0.852903 0.005028
C  -2.27045 -0.552814 -0.001396
C  1.226099 0.635511 0.005497
C  -0.026696 -1.931239 -0.006771
C  2.022905 -0.551324 -0.000098
C  -3.850175 1.344127 0.006929
C  -3.342722 -1.472995 -0.005914
C  1.374859 -1.82791 -0.00613
C  -4.905287 0.401928 0.002288
C  -4.673575 -0.990671 -0.004056
C  4.174856 0.736467 0.003363
C  5.659651 0.413809 -0.003278
H  -1.13045 2.279519 0.900362
H  -1.12992 2.287634 -0.876387
H  1.697231 1.624438 0.011524
H  -0.494715 -2.922119 -0.011298
H  -4.061607 2.417821 0.011837
H  -3.163653 -2.553653 -0.010803
H  1.99064 -2.735867 -0.010502
H  -5.516306 -1.688045 -0.007492
H  3.961463 -1.362537 0.003071
H  3.968472 1.366081 0.896764
H  3.9600 1.375179 -0.880898
H  7.389367 1.351825 -0.011972
