program: Gaussian 09
title: 000284068
version: EM64L-G09RevD.01
frameworkgroup: C1[X(C15H10O2)]
method: RPBEPBE
basis: SDD
operation: Freq
keyword: #pfreq=noraman
keyword: PBEPBE/SDD
title: #p freq=noraman PBEPBE/SDD
converged: YES YES NO NO
title: Mulliken charges:
elementType: O O C C C C C C C C C C C C C C C H H H H H H H H H H
charge: -0.447352 -0.268597 0.258471 0.168594 0.254539 0.442470 0.087922 -0.428396 -0.497229 -0.394879 -0.349858 -0.439748 -0.345186 -0.255861 -0.258597 -0.246861 0.118327 0.306245 0.237563 0.229397 0.219265 0.245453 0.284935 0.234484 0.229414 0.231628 0.383858
chargesum: 0.00000
title: Mulliken charges with hydrogens summed into heavy atoms:
elementType: O O C C C C C C C C C C C C C C C
charge: -0.063494 -0.268597 0.258471 0.168594 0.254539 0.442470 0.087922 -0.122151 -0.259666 -0.165482 -0.130593 -0.194295 -0.060252 -0.021377 -0.029183 -0.015233 0.118327
polarizability: 2.88657034e+02 9.05170253e+00 1.88880961e+02 -3.04477900e-02 9.36148395e-03 6.35598016e+01
1716.lowfreq: -0.0005 -0.0003 0.0005 6.6875 7.3751 15.8938 38.0341 55.3520 103.7648
frequency: 37.9523 55.3463 103.7645 156.7104 175.8339 232.3430 251.0718 266.1833 322.7935 390.8505 399.9733 435.3466 445.3145 496.0264 502.5672 537.2808 542.5274 556.6072 579.7824 605.2709 613.9440 654.9772 711.0819 712.6419 739.1303 765.3376 781.7955 809.3333 835.2563 837.6486 861.6584 867.5419 896.1581 946.4680 961.3142 991.5162 993.7820 998.7064 1016.4022 1037.0738 1062.2266 1094.1859 1132.8169 1169.9303 1177.9280 1180.8999 1209.2388 1238.2305 1254.2003 1272.0344 1300.0008 1320.9385 1385.8331 1396.6520 1405.6878 1421.0650 1448.4348 1451.6987 1504.2255 1530.8386 1579.4997 1594.0027 1613.7890 1627.6446 1631.8386 3124.2654 3128.9567 3134.0045 3141.8822 3151.6056 3163.5429 3169.3810 3187.4490 3189.2854 3529.2319
redmass: 10.0516 5.6002 4.1080 4.2325 6.6492 3.8293 4.3096 6.3161 7.3796 7.7338 3.2029 5.2143 3.4632 6.6087 3.0716 5.8578 2.6816 7.2204 1.8422 5.3713 1.8375 5.5381 5.6751 5.0070 2.0028 1.4879 1.8200 6.1163 6.3911 1.5124 2.1830 4.2945 1.8845 1.4399 1.3896 1.3466 6.3485 1.3720 1.3431 2.3231 2.9915 2.1876 1.7628 1.3843 1.3132 1.1681 1.5803 1.9654 1.5999 1.6912 2.0779 3.1061 4.7458 3.0518 4.2422 2.3349 2.9436 2.3308 3.3593 4.4714 7.2119 5.7547 6.0713 6.6128 7.8400 1.0864 1.0902 1.0885 1.0879 1.0937 1.0980 1.0954 1.0945 1.0954 1.0641
irintensity: 0.9633 0.0242 0.6509 0.2520 1.5656 5.6958 2.4066 1.0753 4.6995 0.8725 2.6914 4.7136 0.0070 4.4637 15.2129 3.1663 18.3379 2.6017 49.6628 71.8257 65.7397 8.5232 0.3091 36.6680 44.8611 20.7169 35.8123 7.4313 6.1794 45.3459 21.0518 4.7064 23.4099 1.1876 4.2068 0.7102 221.1723 1.0244 0.4320 95.8302 118.4634 31.1804 59.5244 20.4101 16.6132 6.2917 6.3801 6.2978 27.2635 5.9849 57.0767 42.3914 21.1102 14.8549 1.3566 5.2626 0.5385 3.5414 43.0626 9.8874 23.8072 28.6918 21.6356 43.3214 168.6795 0.9326 12.5238 8.1073 13.5654 12.2369 23.9632 35.0313 18.4561 4.5682 59.6780
temp: 298.150 k
press: 1.00000 atm
elementType: 8 8 6 6 6 6 6 6 6 6 6 6 6 6 6 6 6 1 1 1 1 1 1 1 1 1 1
symmnumber: 1
zpe: 538611.2 jmol-1
zpe.correction: 0.205146 hartree
zpe.thermalcorrener: 0.217708 hartree
zpe.thermalcorrenthalpy: 0.218652 hartree
zpe.thermalcorrgfe: 0.165638 hartree
zpe.sumelectzpe: -726.935082 hartree
zpe.sumelectthermal: -726.922520 hartree
zpe.sumelectthermalent: -726.921575 hartree
zpe.sumelectthermalfe: -726.974590 hartree
dipole: -1.1247 1.8107 0.0049
dipole: 2.1315
quadrupole: -79.9766 -88.7507 -103.6083
quadrupole: 3.1006 0.0169 -0.0239
quadrupole: 10.8019 2.0278 -12.8297 3.1006 0.0169 -0.0239
hfenergy: -727.1402279 hartree
pointgroup: C01[X(C15H10O2)]
dipole: -0.4295283 -0.7202275 -0.0065038 debye
polarizability: 288.5844745|-6.9962452|188.4585469|-9.2391129|4.0843312|64.0547754 unknown
InChI: InChI=1S/C15H10O2/c16-15(17)14-7-3-6-12-11-5-2-1-4-10(11)8-9-13(12)14/h1-9,16H
charge 0 multiplicity 1
27 atoms
O  4.586797 0.234194 -0.235133
O  3.264468 2.117882 -0.114227
C  -0.210064 -0.736146 -0.06306
C  -1.625636 -0.352453 0.00458
C  0.816861 0.286148 -0.072966
C  -1.971165 1.045317 0.060232
C  2.205854 -0.122764 -0.142064
C  0.415505 1.676678 -0.014086
C  -0.919077 2.031354 0.049126
C  0.181236 -2.107071 -0.120032
C  -2.692906 -1.304002 0.017918
C  -3.343043 1.441279 0.126293
C  2.538739 -1.493697 -0.197213
C  1.528785 -2.483069 -0.185753
C  -4.032738 -0.897251 0.082876
C  -4.365636 0.486866 0.137762
C  3.324293 0.861548 -0.158543
H  1.19386 2.441193 -0.020767
H  -1.199495 3.090672 0.093053
H  -0.580044 -2.89211 -0.112891
H  -2.478327 -2.375937 -0.023202
H  -3.580734 2.51075 0.16846
H  3.591687 -1.77866 -0.249415
H  1.803188 -3.541899 -0.228964
H  -4.829432 -1.649106 0.091512
H  -5.414878 0.796749 0.188712
H  5.278305 0.949037 -0.241709
