program: Gaussian 09
title: 000284055
version: EM64L-G09RevD.01
frameworkgroup: C1[X(C10H19NS)]
method: RPBEPBE
basis: SDD
operation: Freq
keyword: #p
keyword: freq=noraman
keyword: PBEPBE/SDD
title: #p freq=noraman PBEPBE/SDD
converged: YES YES NO NO
title: Mulliken charges:
elementType: S N C C C C C C C C C C H H H H H H H H H H H H H H H H H H H
charge: 0.076262 -0.333016 -0.110941 -0.480150 0.000816 -0.437544 -0.085649 -0.534097 0.120903 -0.731521 -0.709103 -0.725928 0.244282 0.218058 0.212792 0.218291 0.196083 0.209774 0.206312 0.203275 0.232914 0.222243 0.216117 0.208946 0.218289 0.207430 0.229140 0.214903 0.215468 0.217526 0.058121
chargesum: 0.00000
title: Mulliken charges with hydrogens summed into heavy atoms:
elementType: S N C C C C C C C C C C
charge: 0.134384 -0.333016 0.133341 -0.049299 0.219107 -0.031686 0.120663 -0.097907 0.120903 -0.084215 -0.054244 -0.078031
polarizability: 1.61525349e+02 9.68573200e+00 1.33200331e+02 -4.77041537e+00 4.71578680e+00 1.02890406e+02
1716.lowfreq: -0.0027 -0.0026 -0.0012 9.0361 10.3239 15.4764 39.3433 56.7324 73.4802
frequency: 39.2855 55.8067 73.2757 132.5621 166.9604 176.4276 199.1619 206.7323 221.8655 229.0297 270.7968 292.0552 306.6061 327.8463 353.2680 385.4006 400.3947 425.2766 459.0774 502.5201 562.4399 586.9269 651.7130 770.1015 787.8199 825.1751 861.1084 870.5238 884.8789 915.2155 923.8486 946.6085 954.5281 967.8889 974.8485 1033.7594 1071.7132 1089.7657 1092.1250 1125.8633 1139.7819 1165.9241 1170.9911 1210.4098 1223.4116 1258.7248 1266.4935 1273.5643 1288.0330 1306.3471 1316.1620 1326.7155 1330.4321 1346.8948 1352.5876 1378.3918 1386.6824 1397.4483 1456.0503 1464.2228 1465.2625 1468.3720 1474.5709 1475.1310 1475.5455 1483.2459 1490.5871 1571.2023 2283.6574 2959.4905 2965.6868 2967.9124 2968.3540 2972.0622 2975.2892 2976.5588 2983.5524 3009.9418 3026.9172 3033.1914 3045.4338 3063.4608 3064.8173 3069.0776 3071.7858 3072.7560 3076.4044
redmass: 2.4969 4.4701 3.1582 2.9464 2.0848 1.4184 1.0750 1.2380 1.6899 1.3403 3.1484 4.5761 2.5954 2.3964 2.8071 2.6128 2.4518 1.7740 2.6962 3.5192 3.6122 3.3473 4.2033 2.0133 2.0163 2.0388 1.6192 1.8491 2.2874 1.1918 1.7150 1.7115 1.4075 1.7340 1.7016 1.6331 1.6297 1.9464 2.0215 1.9995 2.5106 1.8819 1.8083 1.6843 1.7715 1.6285 1.3628 1.2897 1.4009 1.3021 1.4240 1.4274 1.3405 1.3891 1.5989 1.2071 1.2118 1.2044 1.0919 1.0602 1.0521 1.0797 1.0590 1.0541 1.0555 1.0571 1.0568 8.3270 1.0383 1.0759 1.0759 1.0483 1.0556 1.0360 1.0383 1.0632 1.0658 1.0849 1.0977 1.0985 1.1002 1.0991 1.0998 1.0992 1.0991 1.0993 1.0985
irintensity: 0.0733 0.3658 0.0749 4.7075 3.3218 13.6022 0.3568 0.7067 0.7399 0.5131 0.9316 0.2277 0.5299 0.6043 1.1248 4.5260 1.3479 0.6873 0.0922 3.9692 25.3670 4.8908 6.8126 2.8857 9.1823 21.8854 10.3363 5.2346 7.6381 2.1537 1.4907 1.4556 1.3620 13.2300 6.0102 0.1366 9.3255 2.1889 6.1404 9.4177 1.5839 3.2547 7.3232 3.6774 9.1674 3.0643 6.6919 3.1655 2.5172 2.1545 1.1884 5.6679 3.4382 3.4104 6.2268 13.6275 11.7291 17.8085 6.2803 7.0966 2.3768 9.2876 15.2703 25.1643 6.1857 11.3669 10.4187 15.4241 68.2119 1.1453 11.3684 10.6709 36.4928 28.8290 32.3512 59.2421 16.9258 28.5548 49.8117 24.9253 44.0511 57.2160 3.9162 33.5876 39.1394 81.2446 50.7048
temp: 298.150 k
press: 1.00000 atm
elementType: 16 7 6 6 6 6 6 6 6 6 6 6 1 1 1 1 1 1 1 1 1 1 1 1 1 1 1 1 1 1 1
symmnumber: 1
zpe: 703827.3 jmol-1
zpe.correction: 0.268074 hartree
zpe.thermalcorrener: 0.282445 hartree
zpe.thermalcorrenthalpy: 0.283389 hartree
zpe.thermalcorrgfe: 0.227189 hartree
zpe.sumelectzpe: -844.270448 hartree
zpe.sumelectthermal: -844.256077 hartree
zpe.sumelectthermalent: -844.255132 hartree
zpe.sumelectthermalfe: -844.311333 hartree
dipole: 1.8601 3.2194 1.4590
dipole: 3.9941
quadrupole: -84.3457 -87.1790 -83.5619
quadrupole: -6.6189 -3.8975 -1.7920
quadrupole: 0.6831 -2.1501 1.4670 -6.6189 -3.8975 -1.7920
hfenergy: -844.5385219 hartree
pointgroup: C01 [X(C10H19N1S1)]
dipole: 0.3867523 -1.3172298 0.7646387 debye
polarizability: 138.314773|14.9566523|155.4892309|3.3128625|-8.4451529|103.8120821 unknown
InChI: InChI=1S/C10H19NS/c1-7(2)9-5-4-8(3)6-10(9)11-12/h7-9,12H,4-6H2,1-3H3
charge 0 multiplicity 1
31 atoms
S  1.293585 3.391151 -0.838083
N  0.077505 2.027501 -1.003772
C  -0.939755 -0.126306 -0.698527
C  -0.270042 -1.413429 -1.271717
C  1.921084 -0.937482 -0.028216
C  0.82344 -1.985473 -0.3400
C  -1.87073 -0.382195 0.538914
C  1.269586 0.360974 0.542658
C  0.180024 0.873325 -0.381961
C  2.990652 -1.485987 0.93841
C  -2.40421 0.951697 1.115231
C  -3.056626 -1.303611 0.161314
H  -1.566278 0.335549 -1.486385
H  0.18855 -1.158458 -2.248271
H  -1.038608 -2.180729 -1.478204
H  2.414322 -0.66751 -0.986282
H  0.374452 -2.333617 0.613283
H  1.287435 -2.874309 -0.810807
H  -1.284009 -0.890861 1.331813
H  2.054819 1.11853 0.724936
H  0.821781 0.125753 1.530299
H  3.468019 -2.394352 0.526283
H  3.787477 -0.741942 1.12598
H  2.540574 -1.754003 1.91384
H  -2.973579 1.507287 0.346231
H  -3.076847 0.764798 1.972924
H  -1.589156 1.614404 1.457632
H  -3.643009 -0.861837 -0.667118
H  -3.736019 -1.428673 1.024752
H  -2.72936 -2.311181 -0.151507
H  2.258425 2.904784 0.057953
