program: Gaussian 09
title: 000284025
version: EM64L-G09RevD.01
frameworkgroup: C1[X(C5H11N3O)]
method: RPBEPBE
basis: SDD
operation: Freq
keyword: #p
keyword: freq=noraman
keyword: PBEPBE/SDD
title: #p freq=noraman PBEPBE/SDD
converged: YES YES NO NO
title: Mulliken charges:
elementType: O N N N C C C C C H H H H H H H H H H H
charge: -0.270247 -0.098026 -0.380914 -0.504861 -0.410460 -0.423262 -0.390447 -0.509671 0.224332 0.217149 0.239707 0.239278 0.222037 0.231979 0.214981 0.240683 0.225262 0.322046 0.305549 0.304883
chargesum: 0.00000
title: Mulliken charges with hydrogens summed into heavy atoms:
elementType: O N N N C C C C C
charge: -0.270247 -0.098026 -0.058868 0.105572 0.046396 0.038054 0.056513 -0.043725 0.224332
polarizability: 1.01922103e+02 1.03668190e+00 6.81666042e+01 1.67793417e+00 -1.03214025e+00 6.35383048e+01
1716.lowfreq: -7.2556 -2.9647 -0.0005 -0.0002 0.0006 13.8855 30.8727 63.0358 107.1484
frequency: 30.4360 61.8140 107.1422 110.2602 133.5599 210.4689 253.4849 263.4094 339.4572 397.6683 442.5301 561.7375 630.5032 680.6252 749.9432 776.1744 791.0372 816.5680 828.2181 947.4744 972.9425 986.9914 1035.9355 1061.2421 1066.8398 1080.8965 1108.5117 1141.8486 1149.9840 1198.9358 1246.9019 1262.5604 1278.7919 1287.1981 1316.5830 1364.3604 1439.5803 1446.5867 1456.2320 1467.7372 1485.4944 1616.7839 1680.0495 2921.6961 2994.5767 3031.3856 3053.7396 3061.6977 3063.6932 3164.3364 3181.8314 3392.5109 3507.0426 3550.1750
redmass: 4.1733 3.5865 3.0134 3.3011 1.2252 2.3117 3.5081 4.1859 3.2403 2.6086 3.1324 1.4359 2.1473 4.1248 2.4975 1.9111 1.3630 1.7329 2.3406 4.3874 1.3704 1.7141 2.0035 1.6709 1.7703 1.3054 1.7577 1.4353 2.5787 1.4391 1.9661 2.7318 1.2270 1.1694 1.5225 1.4111 1.7447 1.0934 1.0794 1.1445 1.1162 7.0448 1.0640 1.0668 1.0596 1.0929 1.0506 1.1005 1.0634 1.1147 1.1155 1.0428 1.0986 1.0797
irintensity: 1.9243 3.6931 6.0663 3.1832 16.7491 11.8529 18.8279 4.7068 16.2015 5.3975 6.0126 126.7148 40.0553 5.9601 5.1225 128.0555 6.6697 11.4990 10.8627 6.5941 5.5632 27.4322 6.3782 14.3609 2.3993 12.4886 11.4686 0.2896 4.1139 9.3153 38.7313 9.2400 3.7902 0.1965 25.3576 36.1863 176.3706 11.5671 8.7996 0.8568 10.4566 171.5876 26.5762 38.0493 14.6188 14.0285 28.7617 45.6827 21.7479 1.8422 42.1045 0.1567 1.6837 30.3852
temp: 298.150 k
press: 1.00000 atm
elementType: 8 7 7 7 6 6 6 6 6 1 1 1 1 1 1 1 1 1 1 1
symmnumber: 1
zpe: 437882.2 jmol-1
zpe.correction: 0.166781 hartree
zpe.thermalcorrener: 0.177138 hartree
zpe.thermalcorrenthalpy: 0.178082 hartree
zpe.thermalcorrgfe: 0.129885 hartree
zpe.sumelectzpe: -435.805825 hartree
zpe.sumelectthermal: -435.795468 hartree
zpe.sumelectthermalent: -435.794524 hartree
zpe.sumelectthermalfe: -435.842721 hartree
dipole: 0.4703 -0.9031 0.1330
dipole: 1.0269
quadrupole: -51.6267 -58.9917 -51.8230
quadrupole: 3.4311 0.8587 -2.0997
quadrupole: 2.5205 -4.8446 2.3241 3.4311 0.8587 -2.0997
hfenergy: -435.9726058 hartree
pointgroup: C01 [X(C5H11N3O1)]
dipole: 0.2041537 -0.2874806 -0.1972067 debye
dipolederiv: -0.6571702 0.0872197 0.0847924 -0.0871129 -0.6597878 -0.3213903 -0.1122634 -0.2877553 -0.6857422 -0.7754289 0.0063812 -0.131821 -0.0151638 -0.1680722 -0.1389682 -0.1664347 -0.1419627 -0.2882091 -0.4973671 -0.2771406 -0.2575695 -0.3529056 -0.3767312 0.0342927 -0.3760285 0.0474661 -0.4603231 -0.3539755 -0.0992762 -0.1203116 -0.1553116 -0.1662589 -0.1512766 -0.2157084 -0.1520362 -0.2028087 0.1489208 -0.0273174 -0.0486462 -0.0487178 0.0461197 0.0917167 -0.0264357 0.11003 0.1345899 0.136148 -0.0856599 0.0199926 -0.0829126 0.1100096 0.104718 0.0268337 0.096402 0.045922 0.6449445 -0.0409044 0.0209733 0.0485948 0.1621448 -0.0125378 -0.0031665 0.0216174 0.2358178 -0.4620159 0.0179712 0.0457653 0.0351424 -0.0102234 -0.0003634 0.0638155 -0.0184934 0.1133151 1.2128185 0.1243811 0.224145 0.1426173 0.6603145 0.540435 0.4011109 0.5096771 0.7577198 0.0342161 0.0413053 0.0532756 -0.0353743 -0.1266942 -0.0604558 -0.0010837 -0.096349 0.0710511 -0.0863651 -0.0359308 0.1037474 -0.0304639 0.0523783 -0.0105733 0.1313493 0.0116316 0.0311299 0.0303757 0.0973505 -0.0105696 0.1370604 -0.0573005 0.0510606 -0.0183945 0.0210033 0.0486891 0.0531063 0.059718 0.090334 0.046825 0.0615252 -0.0536269 0.0349811 0.0022665 -0.1197801 -0.0169048 0.023651 -0.0464918 0.0456301 -0.0066338 0.0998706 -0.0474397 0.1140028 -0.0562884 -0.0228798 -0.011472 -0.0308722 0.0346655 -0.0419633 -0.0906398 0.0489139 -0.143536 -0.0773582 0.0662364 0.0521188 -0.0361208 0.0320601 0.0248669 0.0606211 -0.0245472 0.0933244 -0.0308417 0.0572351 -0.0170823 -0.0190756 -0.0253567 -0.0011727 -0.0991837 -0.0157706 -0.1233955 -0.0519012 0.1079502 0.066483 0.0269036 0.0832706 0.2343712 -0.105245 0.0541555 -0.1047392 0.2419061 0.1779516 -0.0445538 0.0606679 0.0714729 0.0245873 0.0572617 0.1523099 -0.0086396 0.2615145 0.2022039 0.0627577 -0.0291188 0.1559802 0.2385204 0.0042843 0.093803 0.0494858 0.0315974 unknown
polarizability: 101.8102261|1.736912|67.2092291|2.0636285|2.3171405|64.6075566 unknown
InChI: InChI=1S/C5H11N3O/c6-7-5(9)1-2-8-3-4-8/h7H,1-4,6H2
charge 0 multiplicity 1
20 atoms
O  -1.725111 0.687779 1.163826
N  2.223935 -0.242775 -0.500788
N  -2.578698 -0.758082 -0.440252
N  -3.935835 -0.385947 -0.242144
C  3.404673 0.642055 -0.187039
C  3.05119 -0.515202 0.735572
C  0.886411 0.362326 -0.24866
C  -0.146383 -0.766895 -0.051072
C  -1.527301 -0.2070 0.286237
H  3.207536 1.6566 0.187048
H  4.250761 0.558635 -0.875918
H  3.640527 -1.437051 0.71294
H  2.61816 -0.260704 1.713633
H  0.620705 0.967025 -1.13581
H  0.861291 1.032488 0.641737
H  0.18085 -1.402955 0.794577
H  -0.169335 -1.407304 -0.952142
H  -2.41714 -1.475451 -1.148608
H  -4.069653 0.610454 -0.467341
H  -4.216382 -0.567995 0.732303
