program: Gaussian 09
title: 000284020
version: EM64L-G09RevD.01
frameworkgroup: C1[X(C7H7ClN2O)]
method: RPBEPBE
basis: SDD
operation: Freq
keyword: #p
keyword: freq=noraman
keyword: PBEPBE/SDD
title: #p freq=noraman PBEPBE/SDD
converged: NO YES NO NO
title: Mulliken charges:
elementType: Cl O N N C C C C C C C H H H H H H H
charge: -0.078682 -0.262251 -0.389529 -0.702156 0.580847 0.558739 -0.307335 -0.298548 -0.463167 -0.441044 -0.077641 0.307872 0.249096 0.224502 0.307082 0.312301 0.310077 0.169836
chargesum: 0.00000
title: Mulliken charges with hydrogens summed into heavy atoms:
elementType: Cl O N N C C C C C C C
charge: -0.078682 -0.262251 -0.082448 -0.079779 0.580847 0.558739 -0.307335 0.009324 -0.214071 -0.216542 0.092196
polarizability: 1.63128116e+02 -3.51876504e+00 1.20795403e+02 -3.57177077e-02 -2.38742928e-03 4.05513457e+01
1716.lowfreq: -6.3013 -3.7501 -0.0027 -0.0026 -0.0025 7.9547 66.6274 115.4852 162.6277
frequency: 66.6230 115.4836 162.6276 178.1905 211.3373 262.8344 289.4650 344.4357 363.7313 381.9302 421.3180 442.3135 448.4040 456.1914 585.8744 673.5830 682.0324 709.7429 713.1146 827.4853 833.1330 839.3889 871.7948 938.2833 976.9668 1007.2087 1030.7806 1120.1759 1153.0170 1229.0190 1297.1685 1325.1723 1360.2151 1389.8164 1436.8217 1477.7496 1523.2509 1571.6294 1630.0134 1638.9222 1652.0269 2943.9964 3136.6069 3160.9211 3183.8066 3482.6396 3573.0266 3712.7015
redmass: 6.7029 3.7605 8.0509 5.0616 9.8691 3.1432 6.0621 1.0686 1.2239 6.9180 3.9711 3.2621 5.4281 4.8374 3.3645 7.3112 1.2049 2.9006 5.4706 1.3618 6.5721 1.7744 6.0315 1.5876 1.3184 3.1069 1.4518 2.6274 1.3138 1.3941 1.6097 3.4591 2.4205 1.6407 4.1967 2.3862 3.3950 5.1939 4.6844 1.4894 3.0687 1.0862 1.0906 1.0923 1.0949 1.0769 1.0451 1.1041
irintensity: 4.1537 16.7568 12.6059 7.0579 0.5842 3.1659 6.7649 15.7799 325.8741 3.8736 0.3187 3.9347 6.9749 7.8496 8.1488 8.5263 61.9170 19.1305 3.5497 7.3950 17.3738 85.4167 40.4226 0.7458 4.3333 29.1092 5.1752 15.7086 1.9991 19.9191 22.0252 74.0898 31.2077 59.6814 16.3299 52.7541 418.0961 97.4699 313.5224 29.5075 197.4689 113.9685 16.2839 4.6035 6.6849 45.1622 96.4751 23.5014
temp: 298.150 k
press: 1.00000 atm
elementType: 17 8 7 7 6 6 6 6 6 6 6 1 1 1 1 1 1 1
symmnumber: 1
zpe: 345918.0 jmol-1
zpe.correction: 0.131753 hartree
zpe.thermalcorrener: 0.142055 hartree
zpe.thermalcorrenthalpy: 0.142999 hartree
zpe.thermalcorrgfe: 0.095699 hartree
zpe.sumelectzpe: -914.949984 hartree
zpe.sumelectthermal: -914.939682 hartree
zpe.sumelectthermalent: -914.938738 hartree
zpe.sumelectthermalfe: -914.986038 hartree
dipole: 4.1145 1.3878 0.0444
dipole: 4.3425
quadrupole: -54.7609 -72.7736 -75.5031
quadrupole: -15.0423 0.1143 -0.0621
quadrupole: 12.9183 -5.0944 -7.8239 -15.0423 0.1143 -0.0621
hfenergy: -915.0817369 hartree
pointgroup: C01 [X(C7H7Cl1N2O1)]
dipole: 1.6533904 0.430011 0.0166799 debye
dipolederiv: -0.1999037 0.1289615 0.0004628 0.1222582 -0.7481667 -0.001317 0.0005488 -0.0016002 -0.0724628 -0.6334348 -0.0461956 -0.0001345 -0.8775693 -0.9365131 -0.0025153 -0.0049009 -0.0030296 -0.3633612 -1.4281003 -0.2428244 -0.000527 -0.4040485 -0.4435674 -0.0007599 -0.0028273 -0.0019742 -0.2837015 -1.6378863 0.4034271 0.0083461 0.4542699 -0.2256945 -0.0003383 0.0219742 -0.0037259 -0.756622 0.5691716 -0.0426622 -0.0009613 -0.2559883 -0.4366422 -0.0012194 -0.0011933 -0.0006174 0.0359681 1.6535696 -0.4409907 -0.0073315 -0.5258636 0.1181625 0.0016635 -0.0078726 0.0012292 0.1531759 0.4008083 0.016074 -0.0013254 -0.2031388 1.0997218 0.002739 -0.0014756 0.0023581 -0.059344 0.1177473 -0.3045337 -0.0012752 0.0141136 0.1370161 0.0004508 0.0000211 0.0014343 -0.1169506 -0.3945322 -0.0559232 0.0002063 0.5887793 -0.2637866 -0.0017293 0.0007956 -0.0007169 -0.1866624 -0.4897952 0.2604833 0.000962 -0.2836829 0.1373203 0.0008587 -0.0004722 0.0004002 -0.233387 1.4096934 0.2958548 0.0023258 1.1315964 1.2210426 0.0051021 0.0069809 0.0058834 0.1293778 0.1294383 -0.0450189 0.0002055 -0.0233077 0.0717644 0.0000022 0.0001323 -0.0003475 0.1798644 -0.0123843 -0.0693947 0.0003953 -0.0693158 0.031897 -0.0001064 0.0006758 0.0001521 0.1804761 0.037808 0.0737898 0.0003779 0.0703576 -0.0970789 -0.0001254 0.0003016 -0.0004084 0.1690481 0.1925634 0.0106328 -0.0002306 0.0798621 0.1860142 -0.0006805 0.0001571 -0.0004166 0.3116748 0.1972033 -0.034744 -0.000556 -0.0809504 0.1443283 0.0009074 -0.0055097 0.0035114 0.3933862 0.2338401 -0.0193481 -0.0012684 0.0197942 0.113873 -0.001913 -0.0084363 -0.0012715 0.3936929 -0.1458064 0.1124121 0.0003281 0.2428342 -0.1096908 -0.0010195 0.0011004 -0.0008605 0.1258272 unknown
polarizability: 162.4188017|-6.4723789|121.5040336|-0.181105|0.1946165|40.5520289 unknown
InChI: InChI=1S/C7H7ClN2O/c8-6-3-5(9)1-2-7(6)10-4-11/h1-4,10H,9H2
charge 0 multiplicity 1
18 atoms
Cl 0.022291 2.935995 0.006092
O  -3.18363 -1.388098 -0.004624
N  -1.96553 0.640362 0.006603
N  3.496232 -0.973917 -0.010497
C  -0.615641 0.19611 0.002947
C  2.155686 -0.588635 -0.004465
C  0.440827 1.141581 0.001965
C  -0.24007 -1.177683 0.000603
C  1.796245 0.790395 -0.001506
C  1.111339 -1.55821 -0.002618
C  -3.121032 -0.126831 0.001759
H  -1.034937 -1.926544 0.000971
H  2.563521 1.570128 -0.003059
H  1.364256 -2.624684 -0.004054
H  -2.086265 1.659036 0.010859
H  3.751683 -1.956411 -0.004702
H  4.241286 -0.284581 0.000687
H  -4.028862 0.517589 0.00334
