program: Gaussian 09
title: 000284059
version: EM64L-G09RevD.01
frameworkgroup: C1[X(C14H23N7O2)]
method: RPBEPBE
basis: SDD
operation: Freq
keyword: #p
keyword: freq=noraman
keyword: PBEPBE/SDD
title: #p freq=noraman PBEPBE/SDD
converged: YES YES NO NO
title: Mulliken charges:
elementType: O O N N N N N N N C C C C C C C C C C C C C C H H H H H H H H H H H H H H H H H H H H H H H
charge: -0.252967 -0.211728 -0.118051 -0.317256 -0.182915 -0.223954 -0.084871 -0.123095 0.005463 -0.361849 -0.383121 -0.379268 -0.319755 -0.317160 -0.672964 -0.672692 0.200629 0.049517 -0.108702 0.227841 0.186881 -0.611834 -0.596471 0.207099 0.197843 0.198242 0.226889 0.256858 0.225610 0.191021 0.207610 0.190046 0.205583 0.333021 0.211325 0.210553 0.220200 0.212674 0.204244 0.223908 0.274491 0.247934 0.246668 0.251744 0.251351 0.273410
chargesum: 0.00000
title: Mulliken charges with hydrogens summed into heavy atoms:
elementType: O O N N N N N N N C C C C C C C C C C C C C C
charge: -0.252967 -0.211728 -0.118051 0.015765 -0.182915 -0.223954 -0.084871 -0.123095 0.005463 0.043093 0.042009 0.103200 0.078876 0.078469 -0.030886 -0.031865 0.200629 0.049517 -0.108702 0.227841 0.186881 0.157260 0.180034
polarizability: 3.35987948e+02 1.68243693e+01 2.19907687e+02 -8.61729794e+00 -4.57007542e+00 1.35158083e+02
1716.lowfreq: -21.6224 -12.6723 -3.9519 -0.0003 0.0005 0.0010 9.2039 12.4260 21.3902
frequency: -16.5744 2.8458 21.2729 35.3367 47.3024 65.6163 68.9243 89.4395 92.6155 103.8476 117.4985 129.9730 146.8517 151.3563 185.7388 194.5872 208.7567 217.6201 265.5724 284.5954 288.7138 301.2446 311.4650 312.3869 328.2945 347.3115 367.4360 393.1943 406.4623 428.0558 442.8710 459.7856 465.6321 471.5874 499.5997 578.0921 599.9271 622.9547 663.5247 670.5423 691.6200 700.1079 710.0361 725.7813 764.1384 788.1168 793.0903 793.7779 808.3441 853.7800 866.0679 917.1424 931.1788 949.7521 970.0665 1024.8014 1034.8416 1056.6590 1065.8631 1072.2209 1073.2227 1079.0276 1083.2597 1093.1909 1116.9130 1125.3433 1129.9812 1130.8943 1167.8255 1193.5747 1202.3143 1226.5840 1235.8123 1239.7505 1250.6018 1256.7859 1281.6604 1284.9191 1293.8927 1305.3955 1320.1424 1338.6177 1355.3458 1359.1741 1364.4054 1374.6642 1385.6490 1386.7676 1408.7467 1426.2952 1453.9851 1460.0027 1461.6351 1462.8596 1469.7499 1472.4562 1473.8546 1475.0427 1476.9046 1477.3733 1479.0172 1480.0497 1485.7578 1489.7203 1493.4219 1500.1208 1580.9527 1605.0783 1644.4458 2856.2228 2862.3749 2877.8336 2982.5571 2983.8128 2990.3638 3014.7968 3015.2721 3015.7399 3026.5668 3029.3900 3036.9438 3048.4579 3075.6094 3077.7815 3085.4670 3089.2962 3089.9119 3107.0642 3107.8883 3144.1595 3145.3785 3541.5494
redmass: 3.7112 4.1366 4.5249 3.9010 3.3203 4.6748 2.0249 5.7769 2.1302 1.2344 2.7832 1.0915 4.0908 3.2869 1.5058 1.5694 1.4882 6.4507 3.6327 2.3193 1.9103 6.6477 2.8942 4.7562 2.2261 4.1068 4.8382 7.9193 5.9950 2.8608 9.5070 2.5839 9.0332 4.1791 5.2667 3.4495 4.6595 1.2784 11.3517 9.7023 4.4276 2.6438 11.1766 10.3120 2.2291 1.2530 1.1641 11.2232 1.9447 1.9932 4.8577 1.9862 2.4086 3.0926 4.2199 2.3650 2.9837 2.4984 2.4795 2.0316 3.0794 2.5725 2.2077 3.0744 2.0545 2.3611 1.3011 1.3089 2.5701 2.4593 2.7415 3.5712 3.5319 2.2134 3.9449 1.3883 1.1723 1.2250 1.1652 3.0901 1.3712 4.5581 1.3853 1.3267 1.3158 1.3596 1.2346 1.2330 1.3411 1.2565 1.1476 1.0680 1.0576 1.4054 1.1156 1.0984 2.0797 1.0865 1.0591 1.0491 1.0780 1.0605 1.0788 1.0821 2.1245 3.8712 5.6788 11.0106 10.0055 1.0721 1.0717 1.0710 1.0356 1.0357 1.0605 1.0595 1.0331 1.0333 1.0867 1.0890 1.0878 1.0993 1.0985 1.0981 1.1058 1.1004 1.1004 1.1022 1.1024 1.1022 1.1019 1.0765
irintensity: 0.1190 0.2315 0.1691 0.1748 0.1894 0.1242 0.3007 2.7277 0.7720 0.9618 4.2028 1.0060 1.2885 1.2280 1.5336 0.2750 0.0643 4.4865 2.9713 1.3143 0.7376 1.4402 3.9503 1.8328 0.9819 3.2937 4.5566 36.9768 1.1728 5.6087 12.9767 6.7590 7.2985 11.1612 4.2092 5.8383 6.3205 87.2021 6.5325 11.4547 6.3868 7.7807 14.7820 0.0592 2.6559 5.8412 4.0841 19.5829 7.2894 11.4928 14.7656 0.9008 1.6788 30.9400 6.2081 9.2008 48.6247 8.2770 51.3486 20.3644 8.7067 67.2584 2.9292 14.4850 18.7239 108.1499 0.4038 0.0040 59.8557 49.3434 20.6208 48.4319 17.4936 5.0171 67.7881 23.6715 13.5646 34.2944 11.6730 2.8655 19.5357 166.6391 13.6080 4.8601 8.3361 0.3546 21.2945 24.3066 27.6929 195.1215 12.6988 1.9942 4.0706 48.2824 39.2860 4.3122 23.9501 26.3459 33.1247 8.4505 10.6321 2.1779 23.8973 23.2007 73.4743 881.2358 563.2302 575.5377 139.5835 32.5075 91.0496 197.0524 28.3323 29.5441 15.3902 22.6972 33.6201 16.7752 4.8924 36.1865 14.9789 32.0872 46.0108 75.6312 16.1818 30.4127 63.5081 12.0503 19.2233 1.1352 0.3294 99.8972
temp: 298.150 k
press: 1.00000 atm
elementType: 8 8 7 7 7 7 7 7 7 6 6 6 6 6 6 6 6 6 6 6 6 6 6 1 1 1 1 1 1 1 1 1 1 1 1 1 1 1 1 1 1 1 1 1 1 1
symmnumber: 1
zpe: 987181.4 jmol-1
zpe.correction: 0.375998 hartree
zpe.thermalcorrener: 0.399506 hartree
zpe.thermalcorrenthalpy: 0.400450 hartree
zpe.thermalcorrgfe: 0.319274 hartree
zpe.sumelectzpe: -1079.229625 hartree
zpe.sumelectthermal: -1079.206117 hartree
zpe.sumelectthermalent: -1079.205173 hartree
zpe.sumelectthermalfe: -1079.286348 hartree
dipole: -7.2778 3.9117 -0.6616
dipole: 8.2889
quadrupole: -137.6841 -157.1843 -135.4860
quadrupole: 11.7804 0.9785 2.8492
quadrupole: 5.7674 -13.7328 7.9654 11.7804 0.9785 2.8492
hfenergy: -1079.6056223 hartree
pointgroup: C01 [X(C14H23N7O2)]
dipole: 2.9616478 -0.8908989 -1.0342987 debye
polarizability: 332.2462399|4.555621|174.3617516|29.1010706|43.164469|184.4457273 unknown
InChI: InChI=1S/C14H23N7O2/c1-5-21(6-2)9-7-8-15-13-16-11-10(17-18-13)12(22)20(4)14(23)19(11)3/h15H,5-9H2,1-4H3
charge 0 multiplicity 1
46 atoms
O  -4.180144 -1.85686 -2.281068
O  -5.102774 1.171016 1.171333
N  5.191907 -0.17261 0.112837
N  1.168775 0.588533 1.623826
N  -2.367107 -1.066073 -1.021623
N  -4.620236 -0.347206 -0.554349
N  -0.548156 -0.270339 0.245007
N  -0.988773 1.339715 2.08243
N  -2.308003 1.317392 1.818327
C  4.057201 -0.131308 -0.850695
C  2.82181 0.603015 -0.282113
C  2.247775 -0.145002 0.943622
C  5.968623 1.100171 0.117124
C  6.0612 -1.369045 -0.071551
C  6.719876 1.346632 1.439262
C  5.433139 -2.662469 0.481057
C  -1.888818 -0.271526 0.011627
C  -0.144355 0.530174 1.280306
C  -2.785691 0.520358 0.79565
C  -3.754845 -1.131019 -1.341845
C  -4.238062 0.514954 0.537527
C  -1.424192 -1.879371 -1.822336
C  -6.05921 -0.433359 -0.902037
H  4.357343 0.344965 -1.816632
H  3.768388 -1.171423 -1.092628
H  3.092644 1.635791 0.01136
H  2.045292 0.680677 -1.067337
H  3.066591 -0.318786 1.663543
H  1.848431 -1.124575 0.625988
H  6.687248 1.135559 -0.740667
H  5.25651 1.931066 -0.041664
H  6.334884 -1.508927 -1.148215
H  7.007014 -1.182053 0.468081
H  1.382276 1.222285 2.398044
H  7.255729 2.3134 1.403459
H  7.46746 0.559409 1.644886
H  6.009472 1.367691 2.284227
H  6.1288 -3.512778 0.3546
H  4.492624 -2.923587 -0.037762
H  5.20933 -2.546641 1.55604
H  -2.014043 -2.413967 -2.580022
H  -0.895494 -2.593817 -1.170798
H  -0.677909 -1.226545 -2.302929
H  -6.40551 -1.476081 -0.818328
H  -6.219128 -0.095382 -1.938816
H  -6.602486 0.212751 -0.198051
