program: Gaussian 09
title: 000284029
version: EM64L-G09RevD.01
frameworkgroup: C1[X(C12H17NOS2)]
method: RPBEPBE
basis: SDD
operation: Freq
keyword: #p
keyword: freq=noraman
keyword: PBEPBE/SDD
title: #p freq=noraman PBEPBE/SDD
converged: YES YES NO NO
title: Mulliken charges:
elementType: S S O N C C C C C C C C C C C C H H H H H H H H H H H H H H H H H
charge: -0.039953 0.135300 -0.191795 -0.304151 -0.305937 -0.439358 -0.303220 -0.667240 -0.646126 0.410874 -0.257259 -0.349569 -0.313363 -0.220101 -0.229122 -0.221530 0.224783 0.195203 0.252816 0.219382 0.230591 0.253527 0.277939 0.273668 0.228988 0.220427 0.246687 0.090371 0.273639 0.249514 0.235414 0.234201 0.235401
chargesum: 0.00000
title: Mulliken charges with hydrogens summed into heavy atoms:
elementType: S S O N C C C C C C C C C C C C
charge: 0.050417 0.135300 -0.191795 -0.050624 0.114049 -0.186541 0.146752 -0.115632 0.049975 0.410874 -0.257259 -0.075930 -0.063848 0.015313 0.005079 0.013871
polarizability: 2.70759723e+02 -1.65092557e+01 1.57545166e+02 -1.22716521e+01 -1.43440138e+01 1.18229148e+02
1716.lowfreq: -9.1874 -1.8684 -0.0016 -0.0012 -0.0010 4.2809 15.1523 17.6905 23.6946
frequency: 14.8658 17.4773 23.5891 43.9975 47.9900 65.9730 124.6467 130.6257 154.9365 168.8960 201.5929 205.2261 217.4692 234.0505 265.8156 293.4060 316.0556 358.6262 397.0716 407.2039 418.2732 427.6827 444.9727 521.9127 612.7770 631.0912 658.4422 669.1859 691.6409 694.1096 702.4199 764.0434 784.6380 819.3939 856.2192 880.8964 887.9213 920.6738 945.7662 987.9408 989.4379 989.8740 1007.2432 1014.1733 1026.2542 1049.8616 1060.1939 1087.8143 1110.7420 1140.0227 1150.0581 1174.8010 1175.5451 1187.1494 1209.9206 1225.9531 1242.7042 1270.8325 1293.8794 1319.9989 1327.5828 1336.1291 1374.3519 1387.1304 1388.6503 1422.3313 1435.8187 1458.5360 1464.3571 1472.6439 1477.1887 1480.2201 1487.2344 1574.9860 1602.2368 1608.7556 2427.1946 2874.0871 2915.5910 2987.9154 3012.4682 3032.0412 3036.6125 3038.5988 3086.8110 3098.8599 3121.7302 3131.1672 3139.6857 3150.1595 3161.3028 3171.5308 3433.9976
redmass: 4.8141 6.4367 3.0716 5.7924 5.9122 4.7754 2.2091 5.8176 3.4735 3.8969 2.0054 1.4953 3.1754 1.0901 3.3611 4.6149 5.2596 2.7328 2.7985 11.6194 6.3019 3.7771 2.7781 8.2617 6.4565 4.9772 3.4011 7.3988 1.7888 1.6865 2.7071 1.1953 1.8870 1.1476 1.2523 7.1267 2.1817 1.3803 1.4193 2.5014 2.2036 2.1177 1.3353 1.5968 2.1635 1.7620 3.2995 1.5743 1.5983 2.9717 2.2970 1.0686 1.3146 1.2419 2.8839 1.3001 1.2304 1.2511 1.1068 1.3138 1.2394 1.3613 1.2983 1.2750 8.3045 1.1060 2.2322 1.2051 1.0555 1.0687 2.1813 1.0605 1.0788 7.3232 7.8818 6.1688 1.0382 1.0708 1.0695 1.0353 1.0849 1.0710 1.0892 1.0795 1.0991 1.1005 1.1057 1.0853 1.0884 1.0928 1.0962 1.1013 1.0740
irintensity: 0.4030 0.0899 0.3436 1.9352 0.1991 2.6072 3.0779 0.9058 0.3389 0.4045 12.6927 9.1122 12.5907 5.3040 8.7126 16.5550 2.7093 13.0732 0.0014 2.4491 0.3061 0.7307 2.3662 3.5295 1.5819 18.0269 13.7769 69.3572 44.4722 79.6329 51.3350 2.2135 45.7740 3.2455 0.1559 194.8569 0.7490 1.8387 3.8759 10.0874 2.9530 3.3845 0.2311 3.2311 2.0044 42.2748 3.3697 12.0295 100.2191 49.7721 26.1273 4.5714 0.9207 76.7785 145.5284 6.3254 12.2078 3.3921 1.0413 3.0571 7.1707 1.5701 16.6532 15.9230 3.9949 15.0699 16.2741 45.1993 7.9686 16.0576 3.9678 5.1112 8.3788 81.9605 65.3014 15.8650 37.0793 87.5725 72.1719 21.6237 6.0958 16.7618 23.2625 27.6615 32.6364 18.6817 4.3132 0.3111 6.5139 15.1106 14.1719 23.5960 0.0937
temp: 298.150 k
press: 1.00000 atm
elementType: 16 16 8 7 6 6 6 6 6 6 6 6 6 6 6 6 1 1 1 1 1 1 1 1 1 1 1 1 1 1 1 1 1
symmnumber: 1
zpe: 692960.1 jmol-1
zpe.correction: 0.263935 hartree
zpe.thermalcorrener: 0.282060 hartree
zpe.thermalcorrenthalpy: 0.283004 hartree
zpe.thermalcorrgfe: 0.213394 hartree
zpe.sumelectzpe: -1392.345067 hartree
zpe.sumelectthermal: -1392.326941 hartree
zpe.sumelectthermalent: -1392.325997 hartree
zpe.sumelectthermalfe: -1392.395608 hartree
dipole: 3.5199 -0.5455 -0.3081
dipole: 3.5752
quadrupole: -110.1627 -107.0894 -113.1375
quadrupole: -1.9832 -9.2400 -2.2635
quadrupole: -0.0329 3.0405 -3.0076 -1.9832 -9.2400 -2.2635
hfenergy: -1392.6090014 hartree
pointgroup: C01 [X(C12H17N1O1S2)]
dipole: -1.3952039 -0.1416455 -0.1088882 debye
polarizability: 272.3221417|12.9016047|114.5326143|7.5836674|-8.5079251|159.6792803 unknown
InChI: InChI=1S/C12H17NOS2/c1-10(15)9-13-7-8-16-12(14)11-5-3-2-4-6-11/h2-6,10,13,15H,7-9H2,1H3
charge 0 multiplicity 1
33 atoms
S  6.996539 -1.02798 -1.291403
S  -0.55539 0.120795 1.624116
O  -0.909966 1.037608 -0.932689
N  3.235545 0.345436 -0.080862
C  4.304494 -0.58735 -0.498827
C  5.65505 0.155241 -0.61157
C  1.964932 -0.27101 0.35638
C  1.131428 0.787813 1.100385
C  6.163873 0.68688 0.737178
C  -2.911302 0.049138 0.01819
C  -1.47944 0.472904 0.035058
C  -3.667106 0.334421 -1.152533
C  -3.533727 -0.616897 1.106992
C  -5.023436 -0.039124 -1.229711
C  -4.891656 -0.988581 1.025884
C  -5.639435 -0.701235 -0.1407
H  4.400682 -1.378082 0.269215
H  4.082122 -1.101577 -1.466601
H  5.569752 0.983274 -1.339987
H  2.203624 -1.105927 1.04107
H  1.36088 -0.691807 -0.480507
H  3.072044 1.07828 -0.785574
H  0.92836 1.655632 0.449242
H  1.632169 1.119451 2.023107
H  7.075713 1.296216 0.612865
H  6.392724 -0.147709 1.425307
H  5.372947 1.305255 1.195997
H  6.348658 -1.328918 -2.481321
H  -3.17138 0.847832 -1.982823
H  -2.961685 -0.846027 2.012707
H  -5.600688 0.183891 -2.133447
H  -5.366917 -1.501896 1.868488
H  -6.694207 -0.991749 -0.200427
