program: Gaussian 09
title: 000284016
version: EM64L-G09RevD.01
frameworkgroup: C1[X(C11H15N3)]
method: RPBEPBE
basis: SDD
operation: Freq
keyword: #pfreq=noraman
keyword: PBEPBE/SDD
title: #p freq=noraman PBEPBE/SDD
converged: YES YES NO NO
title: Mulliken charges:
elementType: N N N C C C C C C C C C C C H H H H H H H H H H H H H H H
charge: -0.368751 -0.487567 -0.130072 -0.340547 -0.402442 -0.325348 0.191259 0.315163 0.029356 -0.693516 -0.369027 -0.342053 -0.225395 -0.230645 0.179557 0.197177 0.259932 0.216076 0.212640 0.204676 0.280858 0.295939 0.202570 0.219677 0.206942 0.225365 0.240074 0.218830 0.219270
chargesum: 0.00000
title: Mulliken charges with hydrogens summed into heavy atoms:
elementType: N N N C C C C C C C C C C C
charge: -0.087893 -0.191627 -0.130072 0.036186 0.073566 0.091968 0.191259 0.315163 0.029356 -0.064328 -0.143662 -0.101979 -0.006564 -0.011375
polarizability: 2.05272141e+02 2.58691177e+01 1.19469413e+02 1.43848506e+01 -1.85847021e+01 1.03609646e+02
1716.lowfreq: -8.2540 -1.7953 -0.0007 -0.0002 0.0003 9.0443 20.4337 37.8981 72.6485
frequency: 19.5262 37.8485 72.5355 98.2986 134.8253 174.6308 222.6646 239.9922 243.3403 278.3086 309.8792 334.5483 362.8130 428.9412 457.3760 509.6170 524.1400 559.6038 578.8569 612.1997 681.2686 693.2971 733.6236 744.2039 759.9424 807.1436 832.6703 847.6749 854.0174 878.5284 919.0902 937.4773 964.5360 967.0419 986.7165 1009.5617 1049.8372 1102.7122 1106.6331 1118.6683 1135.8839 1160.5921 1205.8167 1210.7167 1234.5343 1245.7476 1271.1099 1285.3287 1295.9377 1312.5733 1332.6906 1356.7747 1364.9923 1388.3221 1412.2940 1456.8632 1457.6597 1463.3799 1470.5057 1472.5462 1477.0250 1484.6705 1499.3084 1583.7743 1612.1798 1642.8856 2950.7664 2968.9559 2980.5856 2986.5932 3004.5525 3035.7901 3066.9678 3071.4087 3076.1846 3125.1381 3136.3101 3153.8687 3168.1001 3578.0223 3596.9032
redmass: 3.9880 4.1487 1.5526 4.0647 3.7338 3.2085 1.1548 2.5313 3.4259 1.7584 1.6020 4.9853 3.5930 2.9878 3.8391 1.3299 2.4063 4.6638 3.7639 6.6801 6.8626 4.6340 1.1392 1.3345 3.7034 2.6475 2.1261 1.4677 1.9816 4.8111 1.3858 1.8795 1.2950 1.6914 3.1474 2.0811 2.8450 2.0893 1.9225 2.1071 2.0657 1.1026 2.2886 1.7478 1.4139 1.3286 2.6422 1.6159 1.3591 1.3014 1.8553 1.5008 1.4139 1.2162 2.7157 3.1263 1.1331 1.1230 2.9480 1.1129 1.0432 1.0868 1.6302 5.9793 7.4969 7.0483 1.0610 1.0361 1.0679 1.0611 1.0966 1.1014 1.1013 1.0989 1.0969 1.0851 1.0905 1.0952 1.0991 1.0770 1.0807
irintensity: 0.5445 4.4114 0.0271 1.9863 0.6932 0.5744 0.2834 0.2162 7.8318 27.3658 47.6181 2.7021 8.0375 11.3514 7.3610 121.1254 58.7116 0.6789 0.5770 0.8812 1.9000 15.9579 8.9506 113.7342 9.6518 0.4206 0.4975 0.2736 0.2563 1.2975 5.2460 5.8873 0.0869 4.3258 0.5785 15.6792 1.0037 17.1487 5.5472 4.0991 31.2171 2.8909 9.3127 1.3347 26.7437 7.6852 105.0012 12.3264 6.2968 8.5236 45.2693 5.0630 19.2572 13.3401 8.7186 67.8515 14.5173 22.0721 2.0053 7.4769 12.6371 13.1320 19.7264 385.7227 271.4639 157.5336 30.4005 50.6814 77.1623 45.7735 38.1989 9.3693 82.0567 44.4098 13.3332 0.0688 17.3708 32.1254 19.9963 43.7953 27.8123
temp: 298.150 k
press: 1.00000 atm
elementType: 7 7 7 6 6 6 6 6 6 6 6 6 6 6 1 1 1 1 1 1 1 1 1 1 1 1 1 1 1
symmnumber: 1
zpe: 639576.5 jmol-1
zpe.correction: 0.243602 hartree
zpe.thermalcorrener: 0.257030 hartree
zpe.thermalcorrenthalpy: 0.257974 hartree
zpe.thermalcorrgfe: 0.202156 hartree
zpe.sumelectzpe: -591.398886 hartree
zpe.sumelectthermal: -591.385458 hartree
zpe.sumelectthermalent: -591.384514 hartree
zpe.sumelectthermalfe: -591.440332 hartree
dipole: -2.2562 -3.3843 2.2606
dipole: 4.6534
quadrupole: -78.9211 -75.9330 -84.0740
quadrupole: 3.5162 3.4906 -7.2341
quadrupole: 0.7216 3.7097 -4.4313 3.5162 3.4906 -7.2341
hfenergy: -591.6424881 hartree
pointgroup: C01 [X(C11H15N3)]
dipole: 0.8926944 1.1264921 -1.133998 debye
polarizability: 201.1726773|-13.5507915|113.8711518|-33.8553247|-18.0602387|113.3073719 unknown
InChI: InChI=1S/C11H15N3/c1-2-3-8-12-11-13-9-6-4-5-7-10(9)14-11/h4-7,12-13H,2-3,8H2,1H3
charge 0 multiplicity 1
29 atoms
N  1.70629 0.106425 -1.609062
N  -0.488252 1.086527 -1.213166
N  0.063368 -0.844256 -0.102738
C  3.95532 -0.418277 -0.581653
C  2.723506 -0.931946 -1.364947
C  3.622711 0.064106 0.847809
C  0.480843 0.091703 -0.977301
C  -1.617574 0.76047 -0.429537
C  -1.248632 -0.450508 0.252767
C  4.865712 0.571452 1.608818
C  -2.86673 1.380966 -0.257827
C  -2.166308 -1.056758 1.137611
C  -3.773866 0.755861 0.633336
C  -3.427039 -0.441182 1.317835
H  4.446318 0.402397 -1.148029
H  4.694825 -1.244269 -0.531777
H  2.216768 -1.730088 -0.795939
H  3.046103 -1.357918 -2.336172
H  3.147211 -0.765246 1.406962
H  2.862481 0.867724 0.794098
H  1.952181 0.897829 -2.202007
H  -0.408933 1.87967 -1.845962
H  5.338521 1.422446 1.081525
H  4.601916 0.911135 2.627128
H  5.627638 -0.225325 1.706532
H  -3.139134 2.303695 -0.781915
H  -1.89815 -1.977773 1.664401
H  -4.760048 1.204166 0.797202
H  -4.154147 -0.895727 2.000108
