program: Gaussian 09
title: 000284013
version: EM64L-G09RevD.01
frameworkgroup: C1[X(C13H16N2O3)]
method: RPBEPBE
basis: SDD
operation: Freq
keyword: #p
keyword: freq=noraman
keyword: PBEPBE/SDD
title: #p freq=noraman PBEPBE/SDD
converged: YES YES NO NO
title: Mulliken charges:
elementType: O O O N N C C C C C C C C C C C C C H H H H H H H H H H H H H H H H
charge: -0.305149 -0.259807 -0.285765 -0.495771 -0.440440 0.474490 0.501077 -0.448275 -0.353022 -0.332829 -0.461484 0.423579 -0.766486 -0.460098 0.211685 0.221272 -0.798956 -0.501757 0.232238 0.276566 0.296234 0.311708 0.222453 0.310734 0.265699 0.258674 0.189940 0.273081 0.235339 0.269714 0.239309 0.238283 0.238290 0.219473
chargesum: 0.00000
title: Mulliken charges with hydrogens summed into heavy atoms:
elementType: O O O N N C C C C C C C C C C C C C
charge: -0.305149 -0.259807 -0.285765 -0.199536 -0.129706 0.474490 0.501077 -0.216037 -0.076456 -0.021122 -0.239031 0.423579 -0.052172 -0.187017 0.211685 0.221272 -0.054594 0.194289
polarizability: 3.29833440e+02 6.38777502e+00 1.67765027e+02 -4.58659706e+00 -8.25527674e+00 9.51175474e+01
1716.lowfreq: -76.2002 -4.2624 -0.0008 -0.0007 0.0002 4.7488 5.8507 23.8126 31.4502
frequency: -76.1960 23.7538 31.4020 51.8051 66.2281 78.6588 84.5700 98.1020 104.2138 122.7386 147.8124 155.2055 195.9756 223.3699 267.7351 279.2515 308.0627 339.2917 364.9727 392.3827 412.4340 420.5614 510.9676 533.8945 538.4386 559.9384 573.7235 582.2819 630.3361 637.7700 655.8298 680.4488 712.2993 725.7633 751.3756 803.0738 818.1669 840.9531 854.0696 863.3515 901.6995 930.4069 959.2086 982.3192 985.3186 995.9830 1003.5555 1029.8214 1030.7286 1042.0853 1110.6078 1126.5285 1140.9843 1189.8773 1217.3916 1221.4767 1249.3843 1262.5045 1289.3995 1312.8244 1330.7528 1372.5899 1376.2153 1407.9656 1420.0669 1422.9784 1446.2446 1447.6126 1448.5926 1466.1547 1468.4261 1473.9069 1490.8303 1509.1197 1524.7933 1584.2768 1598.2889 1629.8800 1631.1362 1644.8115 2986.9987 2992.4346 2997.1428 3071.9426 3080.8297 3096.0951 3115.5585 3119.0919 3125.8489 3133.9430 3136.7568 3171.0675 3180.0239 3195.5264 3521.9371 3530.7188
redmass: 1.0556 4.9856 4.4072 4.0352 4.6686 2.7746 1.2547 1.3546 3.6862 3.0521 4.6885 3.6104 4.4516 5.2468 3.7558 4.9639 4.2488 4.4993 4.0266 3.9795 3.0704 4.7797 2.9851 3.5754 2.0858 2.5389 2.0348 3.0144 6.4967 1.1841 5.1232 5.4610 4.5781 4.1235 5.7119 3.8109 1.4288 2.4785 1.9802 1.5564 3.6875 6.2422 1.3205 1.3529 1.6848 7.6833 2.4992 1.5139 1.6556 1.5039 1.2619 1.3492 1.4236 1.1565 3.2562 2.9909 3.2762 2.0028 1.4621 2.2527 1.9909 2.6042 1.3105 1.1970 1.7788 1.8538 1.0518 1.0513 1.1569 1.0600 1.0469 1.1292 2.0464 2.7516 1.8783 6.9823 4.5473 5.8852 5.1648 5.6560 1.0384 1.0399 1.0294 1.0984 1.0976 1.1041 1.0904 1.0963 1.0910 1.1045 1.0978 1.0906 1.0921 1.0945 1.0765 1.0756
irintensity: 0.0252 0.3692 3.9424 8.7682 1.5175 5.5316 0.1048 2.1925 1.4375 4.3108 3.8685 1.3916 1.2570 2.1620 1.4537 17.7602 3.2263 4.6350 1.8229 3.9371 0.3179 9.2956 29.7324 9.7330 85.9136 5.0363 57.4445 4.7979 0.3204 63.9265 0.8491 7.8130 2.4805 1.0247 34.7388 8.2159 49.5850 33.9749 39.8896 20.6979 29.0634 8.4518 2.4944 3.4631 38.4506 224.5706 5.7647 5.8567 7.3199 7.7866 0.0696 24.0338 50.7164 3.6085 57.0103 29.8944 551.6967 7.8333 10.6668 155.0383 57.0552 178.3685 109.6590 48.9708 1.0139 92.3145 19.1908 12.8332 32.2724 23.7588 19.9145 18.8446 16.6634 277.1491 760.3639 77.2563 7.1892 6.3258 293.6791 538.8814 9.4483 29.4022 60.2293 15.3503 18.1187 31.2416 23.4471 6.9645 10.6948 21.9012 7.6151 8.0379 0.8298 6.4471 11.9058 26.7291
temp: 298.150 k
press: 1.00000 atm
elementType: 8 8 8 7 7 6 6 6 6 6 6 6 6 6 6 6 6 6 1 1 1 1 1 1 1 1 1 1 1 1 1 1 1 1
symmnumber: 1
zpe: 709229.3 jmol-1
zpe.correction: 0.270131 hartree
zpe.thermalcorrener: 0.288372 hartree
zpe.thermalcorrenthalpy: 0.289317 hartree
zpe.thermalcorrgfe: 0.221675 hartree
zpe.sumelectzpe: -838.839565 hartree
zpe.sumelectthermal: -838.821324 hartree
zpe.sumelectthermalent: -838.820380 hartree
zpe.sumelectthermalfe: -838.888022 hartree
dipole: 0.7613 0.8533 2.7805
dipole: 3.0065
quadrupole: -98.8564 -100.3937 -109.6310
quadrupole: -30.5566 3.6869 -5.2699
quadrupole: 4.1039 2.5667 -6.6706 -30.5566 3.6869 -5.2699
hfenergy: -839.1096964 hartree
pointgroup: C01 [X(C13H16N2O3)]
dipole: -0.3279131 -0.067911 1.1344451 debye
polarizability: 329.0941939|11.2302593|167.8041852|9.25401|-9.4012612|95.8176351 unknown
InChI: InChI=1S/C13H16N2O3/c1-9(8-13(17)18-3)14-11-4-6-12(7-5-11)15-10(2)16/h4-8,14-15H,1-3H3
charge 0 multiplicity 1
34 atoms
O  5.057388 0.47097 0.201621
O  -5.384751 -0.930449 -0.571238
O  4.036196 2.180317 -1.019437
N  1.148854 -1.332209 0.648596
N  -4.053842 0.911158 0.022976
C  -0.129523 -0.732025 0.453912
C  -2.767914 0.315579 0.16099
C  -1.213671 -1.567877 0.07645
C  -0.386932 0.643287 0.698388
C  -2.520266 -1.065252 -0.064521
C  -1.68756 1.153778 0.546801
C  2.433904 -0.810426 0.46809
C  3.522028 -1.721458 1.009383
C  2.657748 0.407435 -0.155906
C  -5.26606 0.30507 -0.322332
C  3.920916 1.097352 -0.377803
C  -6.445666 1.277117 -0.375666
C  6.331627 1.18592 -0.024891
H  -1.030861 -2.631533 -0.121017
H  0.415331 1.305188 1.03305
H  1.117038 -2.3183 0.915354
H  -3.346607 -1.715389 -0.355668
H  -1.864561 2.219354 0.742555
H  -4.089542 1.918272 0.199629
H  4.335934 -1.841198 0.279368
H  3.98091 -1.282335 1.911997
H  3.117167 -2.716152 1.274043
H  1.814143 0.948649 -0.591006
H  -6.596207 1.784806 0.595199
H  -7.354154 0.709704 -0.622448
H  -6.29196 2.052491 -1.149232
H  6.287742 2.202022 0.403235
H  6.545864 1.266476 -1.104386
H  7.091985 0.575358 0.484616
