program: Gaussian 09
title: 000283988
version: EM64L-G09RevD.01
frameworkgroup: C1[X(C10H20O2)]
method: RPBEPBE
basis: SDD
operation: Freq
keyword: #pfreq=noraman
keyword: PBEPBE/SDD
title: #p freq=noraman PBEPBE/SDD
converged: YES YES NO NO
title: Mulliken charges:
elementType: O O C C C C C C C C C C H H H H H H H H H H H H H H H H H H H H
charge: -0.291990 -0.264072 0.363649 -0.437377 0.004967 0.056693 -0.117256 -0.737691 -0.735973 -0.727548 -0.713368 -0.711480 0.220190 0.195775 0.192840 0.182154 0.208434 0.226774 0.234414 0.200285 0.214428 0.237541 0.215934 0.234282 0.204503 0.226567 0.227337 0.201601 0.237550 0.236725 0.213038 0.201076
chargesum: 0.00000
title: Mulliken charges with hydrogens summed into heavy atoms:
elementType: O O C C C C C C C C C C
charge: -0.291990 -0.264072 0.363649 -0.021412 0.197807 0.238846 0.091177 -0.076219 -0.068070 -0.062196 -0.046880 -0.060640
polarizability: 1.24969924e+02 -5.71967770e-01 1.15920419e+02 -6.34067985e-01 7.15661087e-01 1.00875315e+02
1716.lowfreq: -12.9081 -5.5764 -0.0009 -0.0008 -0.0007 10.7261 58.8279 95.6968 134.0704
frequency: 58.7686 95.6879 134.0696 141.7431 150.6675 166.3035 183.4725 195.6086 213.9887 218.8388 242.9745 268.8238 296.5282 317.9777 322.7745 389.7650 421.1556 426.6243 454.5949 473.0570 505.2312 561.9142 649.2643 760.8494 807.1781 838.7921 844.3429 885.2561 894.1008 917.7013 923.3968 925.2860 942.1732 959.5237 972.7807 990.0917 1026.5951 1040.8857 1090.9536 1115.9904 1133.8185 1150.0098 1162.3126 1197.0582 1213.3306 1227.9244 1260.1429 1287.6854 1292.7001 1311.0318 1326.1361 1351.4063 1355.7305 1364.7148 1372.4839 1375.3199 1388.3652 1389.3991 1394.6807 1430.7995 1453.6711 1458.7098 1460.9847 1464.7059 1472.7595 1473.6937 1476.5530 1477.7588 1486.4888 1493.9491 2892.4432 2919.7598 2975.0307 2984.0711 2985.6370 2988.1767 2988.7983 2991.1599 2994.9901 3052.5330 3065.9027 3077.9419 3082.4076 3086.2988 3087.6748 3089.4211 3092.7542 3096.2654 3096.7305 3100.4146
redmass: 2.5707 2.8877 2.5802 2.6068 1.8690 1.2264 1.0511 1.1561 1.1805 1.2064 2.1371 2.4978 2.4172 2.6525 2.8825 2.3444 2.6743 4.0631 3.0217 2.6792 3.0288 2.5724 4.7308 3.5760 3.2806 2.5971 2.7858 2.0078 3.9028 2.0187 1.3554 1.3040 1.8765 1.5137 1.9489 1.2926 2.7800 1.6440 2.1808 1.8346 2.0453 2.0786 2.1163 1.9013 2.2161 1.9777 1.8138 1.2407 1.4161 1.3803 1.5098 1.3535 1.4688 1.4738 1.2296 1.2682 1.2453 1.2120 1.2925 1.0913 1.0537 1.0474 1.0478 1.0546 1.0462 1.0587 1.0500 1.0498 1.0518 1.0626 1.0823 1.0829 1.0369 1.0454 1.0420 1.0386 1.0358 1.0436 1.0791 1.1022 1.0982 1.0986 1.0996 1.0999 1.0993 1.0999 1.0995 1.1000 1.0999 1.0999
irintensity: 0.0904 1.6704 0.0242 0.1825 2.4130 0.8969 0.0601 0.2793 0.5462 0.6665 0.3661 1.7166 1.7269 1.7637 2.1214 0.6247 0.4178 4.6357 4.2060 3.2193 1.1687 1.8256 3.0410 1.3026 5.5206 9.6498 4.7143 1.7755 124.8106 17.4764 1.9345 14.7609 15.4480 1.6975 8.6283 2.3947 136.6434 11.3131 10.4480 4.3174 6.2674 75.6640 7.3248 21.6202 22.9436 13.9376 34.9311 24.1837 4.2510 2.6467 5.7994 7.9136 19.9657 6.3160 3.1608 45.3150 32.3725 24.0772 16.0020 5.4679 4.6470 12.5570 4.4188 5.0346 5.6477 0.2294 9.2930 8.0126 13.2338 24.8526 59.4242 62.0289 37.8631 23.0553 9.1511 37.9027 31.2294 35.3329 16.8266 20.4633 44.6655 26.8197 19.7060 16.1905 22.8324 55.0653 43.7293 30.4861 34.5260 33.9586
temp: 298.150 k
press: 1.00000 atm
elementType: 8 8 6 6 6 6 6 6 6 6 6 6 1 1 1 1 1 1 1 1 1 1 1 1 1 1 1 1 1 1 1 1
symmnumber: 1
zpe: 742752.2 jmol-1
zpe.correction: 0.282899 hartree
zpe.thermalcorrener: 0.297351 hartree
zpe.thermalcorrenthalpy: 0.298295 hartree
zpe.thermalcorrgfe: 0.243315 hartree
zpe.sumelectzpe: -542.508373 hartree
zpe.sumelectthermal: -542.493922 hartree
zpe.sumelectthermalent: -542.492977 hartree
zpe.sumelectthermalfe: -542.547957 hartree
dipole: -2.1480 -0.5908 -1.1732
dipole: 2.5178
quadrupole: -71.0552 -77.5146 -75.0640
quadrupole: 0.3693 -0.7528 -0.1587
quadrupole: 3.4894 -2.9700 -0.5194 0.3693 -0.7528 -0.1587
hfenergy: -542.7912725 hartree
pointgroup: C01 [X(C10H20O2)]
dipole: -0.8451828 -0.209767 -0.4721303 debye
polarizability: 124.9524395|-0.758885|115.9292105|-0.3969228|0.8925819|100.8840091 unknown
InChI: InChI=1S/C10H20O2/c1-7(2)9-11-8(3)6-10(4,5)12-9/h7-9H,6H2,1-5H3
charge 0 multiplicity 1
32 atoms
O  0.330262 -0.917997 0.278025
O  0.100531 1.460934 -0.098073
C  -1.13655 -1.191346 0.113268
C  -1.916625 0.124488 0.396208
C  -1.351819 1.334156 -0.381605
C  0.812089 0.237761 -0.474719
C  2.30685 0.430597 -0.173614
C  -1.431131 -2.248125 1.188961
C  -1.418945 -1.758164 -1.299071
C  -1.991054 2.663378 0.019984
C  2.563112 0.652793 1.333886
C  3.119079 -0.76421 -0.724796
H  -1.846201 0.34951 1.477338
H  -2.986216 -0.016024 0.144235
H  -1.475052 1.171561 -1.477528
H  0.646386 0.060388 -1.565376
H  2.600827 1.348476 -0.722045
H  -0.863982 -3.173369 0.985099
H  -1.129359 -1.870939 2.181194
H  -2.50891 -2.491729 1.212812
H  -1.287008 -1.00653 -2.097009
H  -0.736076 -2.601144 -1.503191
H  -2.458421 -2.130027 -1.357549
H  -1.534509 3.495643 -0.542783
H  -3.077119 2.651587 -0.184899
H  -1.837469 2.850641 1.097447
H  2.269949 -0.242601 1.908899
H  3.635558 0.851619 1.514445
H  1.977592 1.510172 1.707067
H  2.816032 -1.698123 -0.219888
H  4.19952 -0.608318 -0.552798
H  2.964161 -0.89646 -1.813025
