program: Gaussian 09
title: 000283989
version: EM64L-G09RevD.01
frameworkgroup: C1[X(C8H13Cl3O2)]
method: RPBEPBE
basis: SDD
operation: Freq
keyword: #p
keyword: freq=noraman
keyword: PBEPBE/SDD
title: #p freq=noraman PBEPBE/SDD
converged: YES YES NO NO
title: Mulliken charges:
elementType: Cl Cl Cl O O C C C C C C C C H H H H H H H H H H H H H
charge: 0.120012 0.100905 0.103441 -0.250498 -0.228226 0.350206 -0.433103 0.001580 0.230965 -0.729679 -0.730422 -0.721017 -0.717568 0.229345 0.203557 0.204973 0.226470 0.202662 0.233180 0.240695 0.222605 0.212663 0.246774 0.240813 0.207199 0.232469
chargesum: 0.00000
title: Mulliken charges with hydrogens summed into heavy atoms:
elementType: Cl Cl Cl O O C C C C C C C C
charge: 0.120012 0.100905 0.103441 -0.250498 -0.228226 0.350206 -0.000201 0.206552 0.457435 -0.053142 -0.048380 -0.040536 -0.717568
polarizability: 1.22717783e+02 1.69548325e+00 1.27704983e+02 -3.75695077e+00 8.45373524e-02 1.09104544e+02
1716.lowfreq: -14.2915 -9.3081 0.0010 0.0035 0.0038 6.3853 37.8033 70.6090 102.6129
frequency: 37.7189 70.5884 102.6102 128.1639 145.7727 163.8440 181.6236 194.4183 199.8731 200.3227 215.7307 264.8395 276.0388 284.0280 315.1459 319.2639 368.4271 421.8223 439.9937 441.6360 471.0344 493.0678 609.3048 647.9463 696.2475 719.0759 783.7407 831.6188 855.6092 887.6951 916.7676 926.5390 941.5947 960.8738 988.1799 995.5630 1040.2041 1089.5672 1095.8525 1144.3940 1154.3575 1211.9149 1228.5220 1260.2532 1280.6024 1298.2327 1318.9317 1348.9203 1362.2279 1378.5704 1391.6099 1394.3522 1434.1868 1453.8444 1459.1233 1465.8707 1474.9439 1478.0903 1487.3016 2928.5321 2933.1635 2988.2632 2992.1665 2993.6243 2997.3941 3061.9000 3079.2727 3091.3064 3093.0781 3097.6335 3102.8676 3103.3825
redmass: 6.6703 5.1215 7.6754 2.8755 3.0108 1.0475 2.0680 3.3523 5.2670 2.5320 1.2507 3.3969 6.7625 4.4741 3.1986 3.4231 15.9303 3.4138 3.1473 3.0765 2.5028 3.4671 6.4565 4.6408 7.1305 7.7306 4.1582 3.1405 4.5686 2.0682 1.8343 1.4326 4.3277 2.1610 2.4265 1.8199 1.7665 2.2311 3.5153 1.9294 2.1187 2.2847 1.9371 1.8839 1.2012 1.4123 1.3136 1.3766 1.5922 1.2526 1.2598 1.2197 1.0882 1.0527 1.0476 1.0541 1.0596 1.0498 1.0516 1.0817 1.0833 1.0369 1.0425 1.0361 1.0518 1.1023 1.0986 1.1000 1.0994 1.0994 1.1004 1.1001
irintensity: 0.0027 0.9210 0.0819 0.0473 1.4109 0.1364 0.5196 1.7664 0.0239 0.2157 0.1463 0.5138 0.3523 0.5652 1.0062 2.1147 0.8453 7.4720 1.5065 1.3349 2.2950 2.1665 58.5978 7.9930 85.8552 107.9442 47.9207 31.2793 74.9466 3.6504 4.2526 1.3778 93.4177 36.5420 59.4290 32.8952 28.1463 12.0289 35.2324 85.4705 13.1978 36.7664 8.4998 38.8317 22.5244 3.1256 16.9911 8.1181 16.0964 38.7874 24.9511 17.8210 5.5321 3.7124 14.1294 5.3846 2.8666 10.1023 15.1135 21.7786 57.9179 22.5304 2.3474 20.9005 32.2571 15.3722 32.0912 7.5032 19.7696 40.6147 21.7715 28.0527
temp: 298.150 k
press: 1.00000 atm
elementType: 17 17 17 8 8 6 6 6 6 6 6 6 6 1 1 1 1 1 1 1 1 1 1 1 1 1
symmnumber: 1
zpe: 521638.7 jmol-1
zpe.correction: 0.198682 hartree
zpe.thermalcorrener: 0.213802 hartree
zpe.thermalcorrenthalpy: 0.214747 hartree
zpe.thermalcorrgfe: 0.156484 hartree
zpe.sumelectzpe: -1842.208421 hartree
zpe.sumelectthermal: -1842.193300 hartree
zpe.sumelectthermalent: -1842.192356 hartree
zpe.sumelectthermalfe: -1842.250618 hartree
dipole: -5.0168 0.1322 -1.6456
dipole: 5.2814
quadrupole: -93.1063 -98.8451 -97.3684
quadrupole: -0.6864 0.7652 0.0840
quadrupole: 3.3337 -2.4052 -0.9285 -0.6864 0.7652 0.0840
hfenergy: -1842.4071025 hartree
pointgroup: C01 [X(C8H13Cl3O2)]
dipole: -1.9712182 0.1278964 -0.6445662 debye
dipolederiv: -0.1524859 -0.0064595 -0.0846808 0.0006975 -0.1189787 -0.0440728 -0.0450055 -0.0533605 -0.7369862 -0.2231271 0.1878273 0.062641 0.1366007 -0.6575967 -0.1981251 0.0298436 -0.2037033 -0.230802 -0.3389337 -0.258102 0.1605892 -0.2122908 -0.4706635 0.2181273 0.1283622 0.2370668 -0.3072197 -1.1521398 -0.3594176 0.0562797 -0.2334269 -0.6655038 -0.016574 0.1355314 0.0350864 -0.3928715 -0.9558551 0.4001515 0.045963 0.2621694 -0.8186644 0.0283795 0.063004 -0.0192608 -0.3316481 0.8660386 0.1927757 0.0209163 0.0490907 0.3836021 0.0589235 0.0993533 0.1362439 0.3926563 -0.1073141 -0.0283327 0.0430632 -0.02358 -0.2177562 0.0220405 0.0181752 0.0220028 0.0085773 0.762341 -0.2251661 0.0245905 -0.0870017 0.3743782 -0.0424136 0.0799279 -0.1188882 0.3601997 0.8922881 -0.0099968 -0.0806176 0.019893 0.8682156 0.0015532 -0.3474717 0.0097429 0.3048762 -0.0199145 -0.0422246 0.0180424 -0.056606 -0.0623369 0.0596033 0.0375717 0.0536596 -0.0588356 -0.0776276 -0.0254949 -0.0152657 -0.0064562 -0.0306299 -0.0540244 -0.0778081 -0.075838 -0.1891484 -0.0073506 0.0245951 0.0183842 0.0533377 -0.1262255 -0.0306312 0.0125528 -0.0198749 0.0471569 0.6307416 0.0940046 -0.1413542 0.0856828 1.2755412 0.0227157 -0.1397794 0.0218598 1.3188687 0.0907825 -0.0108028 -0.0232526 -0.0067371 0.0406147 -0.0375314 0.0256589 -0.0378179 -0.1187868 -0.1586659 0.0263729 -0.0446694 0.0183678 0.0881838 0.0088705 -0.0698011 0.0136048 0.0686248 -0.0493069 0.0384359 0.0184711 -0.0098691 0.0301731 -0.0582567 -0.0519458 -0.0014594 -0.203534 -0.0317092 0.0022005 -0.0738426 0.0174545 -0.0373685 0.0126146 0.0893918 -0.0245913 -0.1580846 -0.1603292 -0.0254614 0.0007302 0.0181507 0.085012 0.0143241 -0.0326102 0.0148893 0.0872486 0.086537 0.0851655 0.020005 0.0346494 -0.1178979 -0.0222941 0.032612 -0.0590263 0.0758298 0.0985912 -0.0097037 -0.0616181 -0.0213063 0.0786225 -0.0670594 -0.0352526 -0.0277689 -0.1006599 -0.1509895 -0.052429 -0.0482062 -0.0274725 0.0905597 -0.0138183 -0.016189 -0.0114588 0.0955698 0.0738306 -0.0496017 0.0728673 -0.0561295 -0.0241878 0.1276966 0.0573422 0.1077205 -0.0235566 0.0717549 0.1022198 0.0317415 0.0735138 -0.071846 -0.061981 0.0079913 -0.0212284 0.0713718 0.0385944 -0.1248262 0.0617163 -0.068641 -0.0432752 0.0467687 0.063504 0.0630755 0.05381 -0.1320639 0.0831582 -0.0527374 0.0315202 0.0693932 -0.0077785 -0.0571215 0.0006094 0.084197 0.106313 -0.008888 -0.0297562 0.0083888 0.0786351 0.0329428 -0.0078375 -0.041285 -0.1168537 unknown
polarizability: 122.8385408|1.9002303|127.5724715|-3.7491381|0.3664862|109.1162981 unknown
InChI: InChI=1S/C8H13Cl3O2/c1-5-4-7(2,3)13-6(12-5)8(9,10)11/h5-6H,4H2,1-3H3
charge 0 multiplicity 1
26 atoms
Cl 2.350309 -0.03453 1.840418
Cl 2.682509 -1.823958 -0.578762
Cl 3.090036 1.151908 -0.843136
O  -0.138349 -1.051299 0.278391
O  0.178756 1.326065 0.056775
C  -1.622863 -0.989116 -0.000621
C  -2.11602 0.447414 0.332107
C  -1.250201 1.548178 -0.318652
C  0.603337 0.007021 -0.366062
C  -2.205592 -2.019431 0.976053
C  -1.896773 -1.3995 -1.465715
C  -1.595096 2.958273 0.155169
C  2.091868 -0.161949 0.020596
H  -2.081939 0.586341 1.428638
H  -3.167035 0.560835 0.002992
H  -1.32093 1.490507 -1.428417
H  0.530135 -0.0739 -1.476116
H  -3.309282 -2.020173 0.923317
H  -1.838869 -3.031484 0.732476
H  -1.897784 -1.780661 2.008045
H  -2.981422 -1.548145 -1.616691
H  -1.560513 -0.64524 -2.198886
H  -1.382731 -2.35053 -1.68732
H  -0.928657 3.698031 -0.319533
H  -2.640398 3.207091 -0.102686
H  -1.472495 3.03475 1.249523
