program: Gaussian 09
title: 000284003
version: EM64L-G09RevD.01
frameworkgroup: C1[X(C17H15NO3)]
method: RPBEPBE
basis: SDD
operation: Freq
keyword: #p
keyword: freq=noraman
keyword: PBEPBE/SDD
title: #p freq=noraman PBEPBE/SDD
converged: YES YES NO NO
title: Mulliken charges:
elementType: O O O N C C C C C C C C C C C C C C C C C H H H H H H H H H H H H H H H
charge: -0.232310 -0.250179 -0.249463 -0.454589 0.315792 0.473905 -0.350346 -0.364623 -0.455891 -0.364543 0.001133 0.294659 -0.623052 0.181290 -0.373242 -0.361553 0.285531 -0.237155 -0.232565 -0.230942 -0.763055 0.273327 0.267724 0.238696 0.307689 0.364903 0.274534 0.268914 0.267565 0.270717 0.230891 0.231487 0.231840 0.252832 0.264357 0.245719
chargesum: 0.00000
title: Mulliken charges with hydrogens summed into heavy atoms:
elementType: O O O N C C C C C C C C C C C C C C C C C
charge: -0.232310 -0.250179 -0.249463 -0.089685 0.315792 0.473905 -0.077019 -0.096899 -0.217195 -0.056854 0.001133 0.294659 -0.079604 0.181290 -0.105676 -0.090835 0.285531 -0.006264 -0.001078 0.000898 -0.000147
polarizability: 3.54186875e+02 3.06872426e+00 1.97222403e+02 -1.10066733e+01 -2.09729707e+00 1.08718195e+02
1716.lowfreq: -7.8522 -3.4570 -0.4970 -0.0010 -0.0008 -0.0003 17.6131 37.9366 42.9282
frequency: 17.5810 37.9211 42.8527 46.2838 72.2788 77.0589 87.2433 101.9220 138.9766 145.8063 173.2012 200.5102 221.0985 256.3894 298.4987 314.0702 353.3272 377.4110 388.1976 403.4962 418.4008 437.9019 451.0312 506.0444 539.2659 561.5123 570.8834 607.7629 613.5760 631.1412 665.5997 686.3720 705.3942 724.8471 753.7765 800.5138 815.9158 830.5329 844.4227 860.4512 878.0898 885.8037 908.6956 915.2716 932.1734 946.4421 979.2833 981.5703 986.8958 989.1412 1000.8790 1004.9720 1009.6626 1025.0844 1026.7738 1083.6842 1125.5843 1152.0469 1164.7468 1173.8150 1181.1253 1187.0353 1193.9644 1213.7141 1277.5117 1287.0319 1308.6268 1317.0258 1319.6339 1371.3936 1374.4741 1382.4106 1415.3081 1423.8486 1432.6557 1440.1048 1451.7092 1475.8658 1500.0913 1519.2875 1547.4892 1584.3344 1587.7529 1602.4658 1607.6000 1622.6233 1646.1549 2972.8787 2983.2070 3065.7695 3080.4124 3126.1455 3127.1668 3128.7025 3137.4217 3148.4515 3151.8965 3158.9119 3162.0265 3168.8021 3194.3832 3272.7762
redmass: 4.4357 5.5467 3.6497 4.6805 3.8876 5.0942 4.2705 4.9761 2.3818 1.7074 6.2744 5.3402 6.8508 5.2562 4.3159 5.5569 5.5949 4.9308 6.3880 2.8618 3.0222 4.3360 2.4094 3.7589 4.1127 4.3441 4.0027 4.7883 6.4603 6.8599 5.1616 4.3091 1.6632 4.6653 2.9744 2.4383 1.9602 3.9767 1.5094 1.2845 1.4868 2.5443 1.4115 3.5967 4.2567 1.4954 1.6232 1.5974 1.3908 5.8986 1.3322 1.3238 2.7822 1.8393 2.1496 1.5874 1.3503 3.1842 1.6813 1.0574 1.6368 1.1224 1.1850 3.4330 2.1426 3.4360 1.6740 1.6917 1.3470 4.6413 1.2580 8.7410 1.0938 4.1481 2.2695 1.0754 1.0568 2.2360 2.6696 4.9054 3.9353 4.6026 5.9680 6.9330 6.0656 5.9265 3.1257 1.0672 1.0390 1.0949 1.0908 1.0897 1.0850 1.1004 1.0882 1.0920 1.0912 1.0957 1.0951 1.1011 1.0947 1.0811
irintensity: 1.1570 1.1386 3.0617 0.5928 11.4155 1.7442 0.7912 4.8954 1.6029 4.6398 8.2757 2.6313 2.9604 4.8086 2.2921 4.3787 0.4864 20.4176 2.3672 0.9450 0.2485 3.5808 5.9314 14.7305 15.9229 3.7378 1.7465 25.5304 1.0940 2.9200 27.0496 11.5487 78.3795 7.1557 27.5329 10.9069 11.3438 13.9930 4.6679 8.9168 17.1630 18.1141 88.3561 56.0681 14.8064 4.8316 1.9556 19.0898 7.1029 1.2278 1.0336 1.7294 0.3128 22.6041 3.1584 12.0925 23.4467 9.8234 27.7718 0.5867 3.5532 63.4432 5.4952 188.8512 11.2595 464.9131 183.8858 26.1569 8.5717 46.9773 74.0835 1.6101 52.7344 13.2199 12.2505 28.6195 19.7308 1.2916 70.2531 562.6133 209.0932 212.7442 179.4681 26.2228 22.8588 76.7428 157.9277 1.9316 0.8516 7.9867 6.7759 10.9651 0.2682 9.6225 6.8681 28.6294 1.3828 19.3544 4.5220 24.0799 3.0740 444.0853
temp: 298.150 k
press: 1.00000 atm
elementType: 8 8 8 7 6 6 6 6 6 6 6 6 6 6 6 6 6 6 6 6 6 1 1 1 1 1 1 1 1 1 1 1 1 1 1 1
symmnumber: 1
zpe: 730321.8 jmol-1
zpe.correction: 0.278165 hartree
zpe.thermalcorrener: 0.297069 hartree
zpe.thermalcorrenthalpy: 0.298013 hartree
zpe.thermalcorrgfe: 0.228348 hartree
zpe.sumelectzpe: -935.778584 hartree
zpe.sumelectthermal: -935.759680 hartree
zpe.sumelectthermalent: -935.758736 hartree
zpe.sumelectthermalfe: -935.828401 hartree
dipole: -4.9684 -2.6545 0.9696
dipole: 5.7159
quadrupole: -72.5800 -133.5182 -122.1174
quadrupole: -9.4788 -1.6719 -3.5355
quadrupole: 36.8252 -24.1130 -12.7122 -9.4788 -1.6719 -3.5355
hfenergy: -936.0567488 hartree
pointgroup: C01 [X(C17H15N1O3)]
dipole: 1.9424284 -1.1316526 0.0586028 debye
polarizability: 353.0472126|-11.2297417|181.4442796|-16.8581772|-33.6542606|125.6359807 unknown
InChI: InChI=1S/C17H15NO3/c1-12(19)11-16(20)18-15-9-7-14(8-10-15)17(21)13-5-3-2-4-6-13/h2-10,18H,11H2,1H3
charge 0 multiplicity 1
36 atoms
O  -2.961243 2.31647 -0.9626
O  3.123356 -1.901709 1.230981
O  5.293747 0.782168 -1.32038
N  2.918267 -0.25028 -0.440678
C  -1.240195 0.701535 -0.514197
C  1.529131 0.033455 -0.417223
C  -0.302676 1.369043 -1.350882
C  -0.757441 -0.287843 0.384579
C  1.057638 1.03628 -1.313801
C  0.609339 -0.622272 0.44604
C  -2.671959 1.140638 -0.565921
C  -3.777491 0.205025 -0.155335
C  5.133986 -1.261349 0.021364
C  3.621738 -1.154347 0.338004
C  -3.697643 -1.20324 -0.330736
C  -4.97923 0.772217 0.3486
C  5.869047 -0.050025 -0.557136
C  -4.795651 -2.026085 0.004174
C  -6.067422 -0.051196 0.698754
C  -5.978092 -1.454533 0.528369
C  7.330428 0.100416 -0.186881
H  -0.67127 2.153526 -2.019491
H  -1.450405 -0.780418 1.074277
H  1.767408 1.550854 -1.972963
H  0.975965 -1.37089 1.150266
H  3.510401 0.313136 -1.079996
H  5.246494 -2.085999 -0.715886
H  5.628101 -1.614018 0.941984
H  -2.795169 -1.650314 -0.760341
H  -5.036767 1.861188 0.448466
H  -4.730957 -3.10909 -0.148322
H  -6.984829 0.394802 1.098304
H  -6.826345 -2.095437 0.794211
H  7.411687 0.399529 0.876624
H  7.809425 0.869151 -0.811834
H  7.866826 -0.860987 -0.287993
