program: Gaussian 09
title: 000283974
version: EM64L-G09RevD.01
frameworkgroup: C1[X(C11H10O2)]
method: RPBEPBE
basis: SDD
operation: Freq
keyword: #pfreq=noraman
keyword: PBEPBE/SDD
title: #p freq=noraman PBEPBE/SDD
converged: YES YES NO NO
title: Mulliken charges:
elementType: O O C C C C C C C C C C C H H H H H H H H H H
charge: -0.474346 -0.233318 -0.012849 0.348093 0.320353 0.089003 -0.691631 -0.376614 -0.315120 -0.349191 -0.413186 -0.223856 -0.237826 0.228107 0.248340 0.240020 0.283499 0.238172 0.257801 0.239822 0.366243 0.234098 0.234384
chargesum: 0.00000
title: Mulliken charges with hydrogens summed into heavy atoms:
elementType: O O C C C C C C C C C C C
charge: -0.108103 -0.233318 -0.012849 0.348093 0.320353 0.089003 0.024837 -0.093115 -0.076948 -0.091389 -0.173364 0.010242 -0.003442
polarizability: 1.81188575e+02 6.68333499e+00 1.26244144e+02 -2.36273565e+00 4.29599052e+00 6.67089038e+01
1716.lowfreq: -14.7988 -11.4105 -4.2930 -0.0008 -0.0006 -0.0005 67.4669 113.3692 163.3440
frequency: 67.4628 113.3646 163.3432 219.9141 237.2648 258.3608 287.1295 318.9085 358.2537 390.5713 416.6140 444.2339 473.2576 502.5433 530.3659 552.6376 588.8533 669.3795 683.3086 727.0497 766.1249 779.7715 825.1706 836.1038 863.4657 892.0698 916.6138 963.5515 993.4609 998.9183 1005.4648 1032.2845 1052.3602 1071.2579 1129.9318 1140.5179 1174.9455 1188.6967 1227.5097 1259.1296 1276.7300 1364.7959 1369.3350 1383.5727 1396.3457 1439.7623 1457.1154 1462.2629 1486.0909 1559.4458 1565.8796 1610.7519 1614.6416 2987.3165 3093.2492 3105.2807 3117.6054 3125.3569 3138.9182 3158.5110 3164.5819 3171.4840 3428.9485
redmass: 6.2512 4.1793 3.7614 2.6988 1.6911 2.0329 3.5354 5.5779 4.0350 3.5698 7.0599 1.7446 2.1074 2.7466 4.9812 3.3335 5.0285 5.9838 2.7335 6.1100 1.4451 3.1400 3.5733 1.6493 3.0232 1.4662 2.4369 1.3950 1.4288 1.3777 4.5916 2.3750 1.8832 2.0656 1.4597 1.8136 1.0953 1.8238 1.8359 2.1630 1.7392 1.7030 1.2687 3.0075 2.6359 2.1117 1.1166 1.1422 2.7559 6.8519 7.9992 6.7229 6.5701 1.0331 1.1012 1.1012 1.0889 1.0874 1.0895 1.0949 1.0962 1.0989 1.0644
irintensity: 1.0380 0.7280 2.5548 1.7609 2.8152 3.2847 3.5817 15.9809 7.2544 9.4657 4.0757 64.1879 74.2658 4.8464 8.9359 4.4985 4.2026 2.9769 0.9707 0.4934 49.6137 8.0415 17.0122 59.5086 5.4082 5.6126 10.3016 7.7453 6.1060 1.0929 28.2025 9.4196 29.8650 10.1900 13.2600 13.0778 13.4759 120.9419 26.9160 8.2864 4.1713 38.4386 4.4289 5.0898 15.2234 9.9417 21.2844 4.0186 9.6772 5.9321 209.1951 107.0710 7.0357 15.3134 19.3766 8.8450 8.4337 5.6474 11.4186 19.0111 8.9910 16.3826 25.1187
temp: 298.150 k
press: 1.00000 atm
elementType: 8 8 6 6 6 6 6 6 6 6 6 6 6 1 1 1 1 1 1 1 1 1 1
symmnumber: 1
zpe: 470121.3 jmol-1
zpe.correction: 0.179060 hartree
zpe.thermalcorrener: 0.189883 hartree
zpe.thermalcorrenthalpy: 0.190827 hartree
zpe.thermalcorrgfe: 0.143104 hartree
zpe.sumelectzpe: -574.688012 hartree
zpe.sumelectthermal: -574.677188 hartree
zpe.sumelectthermalent: -574.676244 hartree
zpe.sumelectthermalfe: -574.723967 hartree
dipole: -3.2844 1.7525 1.7310
dipole: 4.1054
quadrupole: -76.0013 -68.6621 -78.9918
quadrupole: -0.4486 3.7230 -0.2811
quadrupole: -1.4496 5.8896 -4.4400 -0.4486 3.7230 -0.2811
hfenergy: -574.8670713 hartree
pointgroup: C01 [X(C11H10O2)]
dipole: 1.2501026 0.7232184 -0.7232437 debye
dipolederiv: -0.3077379 -0.1109274 0.0214195 -0.2233676 -0.5955848 0.1350628 0.0617949 0.0750425 -0.6527838 -1.1279676 -0.050876 0.2530337 -0.3041595 -0.498241 0.0430397 0.267084 0.0281331 -0.4091239 0.1452308 0.1901985 -0.0111911 0.2548006 0.1731986 -0.215182 -0.0286715 -0.2951708 0.3506307 0.1647517 0.0951649 0.1300177 -0.1258002 -0.0294679 0.0319205 0.0833206 0.0186786 -0.0405105 -0.2749657 0.0793963 -0.0161546 0.2313875 -0.1948799 0.002867 -0.07147 0.0726127 0.0218847 1.034383 0.0225562 -0.390925 0.6977964 0.6127304 0.0446122 -0.3820108 0.0250719 0.2340776 -0.0315336 0.0133151 -0.0254117 -0.0347215 -0.0287622 -0.0968878 0.025051 0.1045611 -0.0325434 -0.3257132 0.0265528 -0.0524064 0.0674866 0.093328 -0.0144827 -0.0736415 -0.0601979 -0.1194475 0.7587461 -0.0811396 -0.0411599 -0.2966326 0.3229273 -0.042342 -0.0117547 -0.0782228 -0.0823287 -0.6135914 -0.0600712 0.0399065 -0.6423295 -0.2102178 0.0695582 0.0752297 0.0399311 -0.1870082 0.112789 -0.0970885 -0.0007548 0.0926002 0.1292938 -0.0363514 0.0078063 -0.0366509 -0.1410283 0.0933607 -0.0330669 0.0393449 -0.0192782 0.101888 -0.0348928 0.0213192 -0.044708 -0.1252841 0.1273525 0.0689319 -0.0021687 0.1323709 -0.1963386 -0.0216312 -0.0065736 0.0064188 -0.1571091 0.0748597 -0.040624 0.0432139 -0.027413 -0.0290152 0.1244974 0.0461561 0.0777157 0.0031945 0.0443877 0.103361 0.0225949 0.0638937 -0.0198592 -0.0588168 0.0090042 -0.035625 0.0445853 -0.110226 -0.073327 -0.0518919 -0.0341174 0.0858424 -0.0273422 -0.0204521 -0.0241311 0.047141 0.1036751 -0.0428625 0.0076819 -0.0172853 -0.0116852 0.0146114 -0.0048304 0.0181962 0.1466923 0.0662464 -0.0918775 0.0126373 -0.0075669 -0.0811484 0.0283077 0.0100789 0.0217118 0.127175 0.0204161 0.0867201 0.0163128 0.0418458 -0.0170219 0.0105235 0.0502346 0.0107511 0.1664467 0.0778324 -0.0149964 -0.0032006 -0.0659746 -0.0959089 0.0310525 0.0018022 0.0306603 0.1518379 0.116041 -0.0376539 0.0361314 0.1625655 0.4113909 -0.029638 -0.038028 0.0001705 0.3467323 -0.0236741 0.0935962 -0.024167 0.1082897 -0.0026905 0.0318171 -0.0177209 0.0336733 0.1466942 -0.1246627 -0.0452822 -0.0028627 -0.0543907 0.080222 0.0096969 -0.0037282 0.0113778 0.1600752 unknown
polarizability: 181.7175024|-3.8784918|125.1302416|-2.5490421|-7.2109872|67.2938787 unknown
InChI: InChI=1S/C11H10O2/c1-11(13)9-5-3-2-4-8(9)6-7-10(11)12/h2-7,13H,1H3
charge 0 multiplicity 1
23 atoms
O  -1.348194 -1.997233 0.750462
O  -3.180397 0.016871 0.676375
C  -1.047433 -0.847047 -0.098245
C  0.418839 -0.463389 0.034601
C  0.797676 0.904289 -0.129589
C  -2.025587 0.308702 0.227237
C  -1.328116 -1.232638 -1.593832
C  1.408155 -1.446198 0.232092
C  -0.235691 1.936873 -0.225554
C  -1.577402 1.673801 -0.05506
C  2.176608 1.252869 -0.131116
C  2.776242 -1.085117 0.247492
C  3.162731 0.263284 0.051706
H  -1.070797 -0.414414 -2.289441
H  -0.719152 -2.118441 -1.840279
H  -2.396484 -1.486316 -1.711851
H  1.097465 -2.482868 0.392926
H  0.097172 2.971985 -0.378832
H  -2.327088 2.471048 -0.031042
H  2.466153 2.302789 -0.260462
H  -2.303459 -1.890271 1.024993
H  3.540002 -1.853102 0.412227
H  4.223158 0.536624 0.053693
