program: Gaussian 09
title: 000283978
version: EM64L-G09RevD.01
frameworkgroup: C1[X(C13H11NO2)]
method: RPBEPBE
basis: SDD
operation: Freq
keyword: #p
keyword: freq=noraman
keyword: PBEPBE/SDD
title: #p freq=noraman PBEPBE/SDD
converged: NO YES NO NO
title: Mulliken charges:
elementType: O O N C C C C C C C C C C C C C H H H H H H H H H H H
charge: -0.194303 -0.215464 -0.135886 -0.417416 -0.386660 0.148900 0.192187 -0.175883 0.336706 0.264603 -0.188621 -0.811773 -0.376844 -0.377171 -0.231406 -0.225982 0.244213 0.248296 0.247383 0.259303 0.234486 0.223625 0.280576 0.287288 0.292914 0.238512 0.238416
chargesum: 0.00000
title: Mulliken charges with hydrogens summed into heavy atoms:
elementType: O O N C C C C C C C C C C C C C
charge: -0.194303 -0.215464 -0.135886 0.075093 0.120026 0.148900 0.192187 -0.175883 0.336706 0.264603 -0.188621 -0.073086 -0.089556 -0.084256 0.007106 0.012434
polarizability: 2.35307944e+02 -1.24100941e+01 1.86120764e+02 -3.88735476e+00 3.04233934e+00 7.07774571e+01
1716.lowfreq: -0.0004 -0.0004 0.0005 2.8816 5.1892 12.4606 48.4914 82.3865 114.9320
frequency: 48.4841 82.3826 114.9299 124.6404 132.0295 155.6382 158.4253 197.9869 254.0253 293.1772 312.0620 349.0211 376.7149 396.8385 410.6724 420.8040 441.9954 481.4207 547.7546 570.0326 648.7493 687.0728 691.6675 724.0295 776.6791 792.5993 801.9813 825.3589 846.4851 911.3638 928.5225 947.8463 978.3620 993.4403 994.8930 1011.7955 1031.1031 1036.2944 1068.0157 1088.2396 1095.7642 1108.4648 1113.9078 1134.2157 1149.4643 1171.0305 1188.8250 1254.3582 1286.4111 1338.5726 1387.2904 1399.8701 1419.3569 1439.6020 1458.6969 1463.3841 1470.3619 1477.1642 1483.7501 1517.3821 1544.8877 1573.3601 1602.6576 1608.4148 2975.0621 3046.6760 3073.1262 3091.7601 3106.6603 3134.8120 3150.4345 3161.8392 3170.9039 3179.4855 3199.5229
redmass: 5.6925 4.1675 2.2592 2.7966 1.3123 3.5311 4.7081 4.5835 4.0879 4.6791 3.9535 4.7985 8.8461 6.0067 6.8121 3.5282 4.8957 9.8097 4.8915 6.3326 6.3830 4.0814 5.9509 2.9792 3.2500 1.1557 1.7103 4.7606 3.2322 5.5657 1.6668 4.0452 2.7236 1.3589 1.2095 1.3552 1.9920 1.5520 1.8270 2.0991 1.4655 1.3504 1.5398 1.5847 2.5488 1.1171 2.3410 1.9794 2.8721 4.2206 1.2696 9.8273 4.7191 2.3686 1.1125 1.1116 2.5582 1.0747 1.3502 8.1618 10.6024 7.9274 7.7771 7.2181 1.0382 1.0963 1.0520 1.0573 1.0973 1.0862 1.0903 1.0945 1.1001 1.1183 1.1176
irintensity: 7.7984 2.8742 2.5821 0.2219 0.6594 2.4838 1.9721 14.3673 0.2747 1.4699 9.9725 5.9473 15.3023 9.8761 1.4691 0.5427 5.1894 1.2203 12.4677 4.4582 3.9924 12.3286 0.4195 42.7458 14.6743 34.2648 35.6584 2.5390 1.3863 12.6106 0.2692 73.8545 3.9382 3.6863 7.6221 0.1418 1.3861 1.0036 14.3560 12.2082 4.4454 2.5966 38.6925 8.0747 30.0866 4.2156 15.0447 56.0549 181.0229 193.9984 27.8912 1.4308 189.6880 1.6578 23.6098 2.6771 15.2964 21.0044 35.8487 62.7953 278.6109 215.2787 35.2315 32.5025 19.1639 16.6446 27.8354 27.2033 2.8931 4.6148 7.3067 2.1365 27.2434 3.9375 20.5047
temp: 298.150 k
press: 1.00000 atm
elementType: 8 8 7 6 6 6 6 6 6 6 6 6 6 6 6 6 1 1 1 1 1 1 1 1 1 1 1
symmnumber: 1
zpe: 542093.8 jmol-1
zpe.correction: 0.206473 hartree
zpe.thermalcorrener: 0.220127 hartree
zpe.thermalcorrenthalpy: 0.221071 hartree
zpe.thermalcorrgfe: 0.166190 hartree
zpe.sumelectzpe: -706.015259 hartree
zpe.sumelectthermal: -706.001605 hartree
zpe.sumelectthermalent: -706.000661 hartree
zpe.sumelectthermalfe: -706.055542 hartree
dipole: 1.6617 -1.6353 1.2464
dipole: 2.6436
quadrupole: -66.8864 -103.6177 -94.0306
quadrupole: 5.4143 2.4197 -1.5882
quadrupole: 21.2918 -15.4395 -5.8524 5.4143 2.4197 -1.5882
hfenergy: -706.2217319 hartree
pointgroup: C01 [X(C13H11N1O2)]
dipole: -0.6332158 -0.6266888 -0.5367251 debye
polarizability: 235.2361376|12.7181268|186.2969969|2.1355267|1.8788379|70.6730303 unknown
InChI: InChI=1S/C13H11NO2/c1-8-11(14-6-7-14)13(16)10-5-3-2-4-9(10)12(8)15/h2-5H,6-7H2,1H3
charge 0 multiplicity 1
27 atoms
O  -0.661892 -2.390517 0.076901
O  0.748527 2.924071 0.030595
N  -2.674634 -0.481923 0.163184
C  -3.865843 -0.166821 -0.665235
C  -3.381091 -1.611277 -0.467667
C  -1.354311 -0.070223 0.060657
C  -1.004168 1.2827 0.079478
C  -0.317844 -1.166192 0.052474
C  1.113482 -0.755302 0.012419
C  1.467501 0.621581 -0.006843
C  0.410349 1.688729 0.034276
C  -2.04924 2.36772 0.199708
C  2.123354 -1.748489 -0.007516
C  2.831052 0.991621 -0.047994
C  3.482082 -1.372874 -0.050034
C  3.835631 -0.000603 -0.070842
H  -3.69483 0.290838 -1.647587
H  -4.747746 0.19326 -0.125868
H  -3.918139 -2.274775 0.217248
H  -2.894312 -2.116598 -1.308127
H  -2.70942 2.177465 1.067119
H  -2.699254 2.428723 -0.693895
H  -1.550494 3.341409 0.324288
H  1.820871 -2.800295 0.01068
H  3.075366 2.058365 -0.058559
H  4.263021 -2.140471 -0.067263
H  4.890982 0.291278 -0.102997
