program: Gaussian 09
title: 000283995
version: EM64L-G09RevD.01
frameworkgroup: C1[X(C8H10N2O4S)]
method: RPBEPBE
basis: SDD
operation: Freq
keyword: #p
keyword: freq=noraman
keyword: PBEPBE/SDD
title: #p freq=noraman PBEPBE/SDD
converged: YES YES NO NO
title: Mulliken charges:
elementType: S O O O O N N C C C C C C C C H H H H H H H H H H
charge: 0.761517 -0.550554 -0.589780 -0.202626 -0.247937 -0.453950 -0.139223 -0.186133 0.500014 -0.201236 -0.186852 -0.323160 -0.429210 0.227992 -0.778075 0.271198 0.293148 0.316643 0.229676 0.307826 0.261437 0.214971 0.262294 0.262866 0.379154
chargesum: 0.00000
title: Mulliken charges with hydrogens summed into heavy atoms:
elementType: S O O O O N N C C C C C C C C
charge: 0.761517 -0.550554 -0.210626 -0.202626 -0.247937 -0.146124 0.122213 -0.186133 0.500014 0.069961 0.106296 -0.006516 -0.199534 0.227992 -0.037944
polarizability: 2.56605221e+02 1.97223404e+01 1.74512823e+02 -2.69523834e+00 -3.95821076e+00 8.22390371e+01
1716.lowfreq: -11.5976 -2.7423 -2.1949 -0.0011 -0.0011 0.0007 15.3582 25.7090 32.6994
frequency: 14.2633 25.6038 32.4723 49.7033 55.9245 75.4749 100.6942 116.3114 132.0411 148.2427 181.6246 191.4997 197.1276 263.3634 289.2059 325.1095 359.5344 383.9471 412.7891 415.9437 444.8564 508.8653 528.4408 534.5423 550.4977 597.0561 621.5987 650.7530 675.8012 729.9368 823.7628 840.9665 861.6858 866.9578 930.9221 974.5271 988.6002 994.8309 996.7271 1040.4171 1052.7416 1119.6231 1167.9648 1182.5519 1215.1179 1262.4373 1297.2464 1314.8333 1366.8493 1390.4470 1409.2779 1447.7959 1458.0146 1468.8029 1477.0076 1499.3867 1592.7080 1600.8457 1629.7255 2820.7382 2997.6157 3098.7122 3101.7438 3120.8907 3151.0688 3159.5248 3196.4677 3288.0090 3533.2124
redmass: 1.1419 8.7279 4.3412 5.2300 3.9534 4.4116 4.8556 7.1882 5.6350 8.0272 6.5501 8.6217 7.8152 6.7177 6.5507 7.7664 4.9381 3.7463 2.6702 1.6547 6.1097 5.1401 2.0081 1.5347 4.2405 3.1154 6.9675 1.1989 6.2436 3.3221 4.8194 1.3804 2.1511 3.6982 6.2517 1.3352 3.1995 1.8477 1.3748 1.6406 2.4026 1.3232 1.1181 1.1294 3.4139 1.8388 1.4487 7.1586 4.2693 1.2248 4.7404 1.0451 1.2116 1.1298 2.1523 2.3035 6.7537 5.5827 4.9247 1.0752 1.0363 1.0994 1.0993 1.0894 1.0951 1.0915 1.0953 1.0678 1.0765
irintensity: 0.2811 2.6550 10.6436 3.4512 24.2669 5.4884 2.1781 13.3603 4.2567 4.4876 8.9795 15.1208 6.1065 7.4687 21.5054 7.5430 23.4256 4.5936 14.1027 73.7858 17.2870 29.3480 61.1380 100.7367 66.8388 1.6013 4.0667 55.4535 1.4245 1.4029 1.0635 31.6043 44.2460 86.7504 2.5636 0.8317 6.4565 12.6769 3.7774 15.5144 50.2893 19.8609 104.0526 38.9759 65.2666 56.4926 81.8090 205.4255 233.2221 50.2883 15.4120 16.1711 24.7615 15.5299 33.6194 452.4036 73.3745 62.6546 109.3481 142.3368 11.2641 12.5496 11.2560 14.0124 15.0406 2.2367 8.1481 26.5021 15.7469
temp: 298.150 k
press: 1.00000 atm
elementType: 16 8 8 8 8 7 7 6 6 6 6 6 6 6 6 1 1 1 1 1 1 1 1 1 1
symmnumber: 1
zpe: 456698.2 jmol-1
zpe.correction: 0.173947 hartree
zpe.thermalcorrener: 0.191384 hartree
zpe.thermalcorrenthalpy: 0.192328 hartree
zpe.thermalcorrgfe: 0.124835 hartree
zpe.sumelectzpe: -1118.009138 hartree
zpe.sumelectthermal: -1117.991702 hartree
zpe.sumelectthermalent: -1117.990758 hartree
zpe.sumelectthermalfe: -1118.058251 hartree
dipole: -4.2959 -0.0804 -2.7761
dipole: 5.1155
quadrupole: -80.0930 -97.8509 -96.9194
quadrupole: 28.5534 -10.6309 -3.1815
quadrupole: 11.5281 -6.2298 -5.2983 28.5534 -10.6309 -3.1815
hfenergy: -1118.1830856 hartree
pointgroup: C01 [X(C8H10N2O4S1)]
dipole: -1.7081329 -0.5055522 -0.9365892 debye
dipolederiv: 1.5407982 0.0518703 -0.0568798 -0.3763943 0.6287126 0.4143341 0.0115198 0.0082478 0.6333111 -0.6680699 -0.0017706 0.0859533 0.2818288 -0.5903118 -0.1005945 -0.0247282 0.1768726 -0.3866976 -0.699277 -0.0493954 -0.1038055 -0.1073148 -0.5139487 -0.2642983 -0.1688113 -0.1132576 -0.5553338 -0.9315138 -0.766256 0.2328554 -0.3393504 -0.4421255 0.0982034 -0.4867899 -0.6083668 0.130147 -0.6710633 -0.1016928 0.0694686 0.4745634 -0.8479816 0.2157567 -0.2020878 0.2437927 -0.4621519 -2.0257464 0.3964071 -0.1050525 0.6613439 -0.5009445 0.0507554 -0.1947202 0.060785 -0.3381173 0.8961558 0.8513721 -0.5036694 0.3526553 0.1659407 -0.0012333 0.1361692 0.5384416 0.1241944 -0.3727873 0.065146 -0.0347208 0.1168747 -0.114934 -0.001359 0.2604184 0.0333502 -0.1532605 1.5462069 -0.1547998 0.0005222 0.0770123 0.0828712 0.0160027 -0.1246657 0.0370572 0.1141172 0.0683409 0.0049185 0.0001503 -0.24485 -0.0101306 -0.0254813 0.146419 -0.0183562 -0.0750904 0.0293114 -0.0684453 0.0388179 0.2665947 0.0368262 -0.0605473 -0.1236408 -0.051298 -0.0532035 -0.4777134 -0.0438229 0.0270121 -0.1762868 -0.0386281 -0.0460452 0.0795831 -0.0508433 -0.1333215 -0.4043517 0.1126559 -0.053927 0.2501641 -0.0181535 -0.0833098 -0.1168891 -0.094668 -0.1587809 1.7391747 -0.1903528 0.0009542 -1.0730394 1.1485545 -0.401171 0.3929631 -0.4375499 0.3955176 -0.5136918 -0.0521156 0.0587095 -0.0060684 0.0280053 -0.0110586 0.0485653 -0.0087849 -0.003751 0.0892192 -0.0576449 0.0297017 -0.0429792 0.0584903 0.0419389 0.0235549 0.0473729 0.1170138 0.1796391 0.1133443 -0.0424087 0.0203289 0.0932953 0.030108 0.0027719 0.03301 0.1445438 0.1461376 0.0238789 -0.0095686 -0.0200616 0.0845452 0.0432961 0.002593 0.0400038 0.1619645 -0.0560525 -0.1084016 0.0613815 -0.0870325 0.0065998 0.0766865 0.0490965 0.0735062 0.1334078 0.1764912 0.0141683 0.0016628 -0.0144236 0.1372221 0.0802165 0.017486 0.0765435 0.2670503 0.011357 -0.0365687 0.2116175 0.123264 0.3631234 -0.182925 0.1749196 -0.0737824 -0.2251859 0.0456697 0.0218149 -0.0044308 -0.0693807 -0.1040128 0.1033157 0.0352472 0.0983528 0.0730854 0.0484247 -0.0105329 -0.053152 -0.0363956 0.1160589 0.0284335 -0.10495 0.0090042 -0.0289046 0.0680466 0.0217144 0.037299 0.0383076 0.0140055 -0.0870808 0.0902766 -0.0693993 0.053162 0.2352941 -0.0354914 0.111509 -0.0693603 0.2169201 0.0660565 0.0756994 0.0499657 0.2262841 unknown
polarizability: 255.4267572|17.3720066|156.333193|-14.1377096|-37.9462357|101.5971309 unknown
InChI: InChI=1S/C8H9NO3S.HNO/c1-6(10)9-7-2-4-8(5-3-7)13(11)12;1-2/h2-5,9,11H,1H3;1H
charge 0 multiplicity 1
25 atoms
S  2.99902 -0.8000 -0.233779
O  3.354108 -2.268088 0.39964
O  3.322161 0.489782 1.079297
O  4.751481 1.856044 -0.98845
O  -3.66732 1.43745 -0.851783
N  -3.077584 -0.630719 0.093699
N  3.815548 1.468832 -1.78096
C  1.13165 -0.702756 -0.134076
C  -1.660806 -0.607992 -0.005047
C  0.464954 0.444822 -0.602592
C  0.444946 -1.807978 0.398878
C  -0.942202 0.497338 -0.542702
C  -0.95769 -1.753822 0.464046
C  -4.000071 0.344831 -0.309009
C  -5.459584 -0.011948 -0.039327
H  1.030749 1.292342 -1.001872
H  1.01097 -2.675802 0.755127
H  -1.490719 1.37138 -0.89682
H  -1.512104 -2.603863 0.881354
H  -3.472354 -1.473544 0.517095
H  4.237471 1.295311 -2.759833
H  -5.604481 -1.007714 0.414219
H  -6.01923 0.031935 -0.989167
H  -5.895555 0.749429 0.630302
H  3.979744 1.137729 0.668059
