program: Gaussian 09
title: 000284043
version: EM64L-G09RevD.01
frameworkgroup: C1[X(C22H35N3)]
method: RPBEPBE
basis: SDD
operation: Freq
keyword: #pfreq=noraman
keyword: PBEPBE/SDD
title: #p freq=noraman PBEPBE/SDD
converged: YES YES NO NO
title: Mulliken charges:
elementType: N N N C C C C C C C C C C C C C C C C C C C C C C H H H H H H H H H H H H H H H H H H H H H H H H H H H H H H H H H H H
charge: -0.146496 -0.097706 -0.100387 -0.426258 -0.444420 -0.388197 -0.378971 0.459019 -0.324893 -0.318541 -0.325225 -0.315366 -0.601484 -0.376847 0.401339 0.389373 -0.470179 -0.676607 -0.673851 -0.672818 -0.675880 -0.436165 -0.418567 -0.246961 -0.257953 0.207795 0.232590 0.217209 0.231117 0.195856 0.245473 0.231775 0.206135 0.202551 0.190377 0.201759 0.190846 0.204655 0.190547 0.199299 0.192144 0.240336 0.223475 0.228798 0.225704 0.217340 0.208481 0.227481 0.209164 0.206422 0.228075 0.205579 0.208665 0.227509 0.208337 0.208340 0.231717 0.234468 0.221188 0.222837
chargesum: 0.00000
title: Mulliken charges with hydrogens summed into heavy atoms:
elementType: N N N C C C C C C C C C C C C C C C C C C C C C C
charge: -0.146496 -0.097706 -0.100387 0.014127 0.003905 0.053132 0.058939 0.459019 0.068035 0.074064 0.069976 0.076077 -0.361149 -0.153372 0.401339 0.389373 -0.241381 -0.025082 -0.030784 -0.030500 -0.031693 -0.204448 -0.184099 -0.025774 -0.035116
polarizability: 3.85122419e+02 1.85007090e+01 2.91644769e+02 -1.97379690e+01 -8.11826478e+00 1.69699741e+02
1716.lowfreq: -6.4999 -4.8483 -0.0006 -0.0001 0.0004 3.9140 12.5642 18.2885 21.8932
frequency: 12.2797 18.1352 21.7857 24.9862 29.5736 41.3208 61.8652 65.8189 76.8479 79.1052 87.2095 92.7391 119.1807 151.7025 154.5548 181.6214 188.7496 204.1738 216.8723 221.0742 236.6344 256.1227 258.6381 288.5341 294.1937 297.0067 306.5562 343.4788 365.0877 377.5581 396.6496 398.9883 413.9866 440.3788 445.2621 470.3353 472.2564 490.8644 516.7977 527.8008 542.4589 568.9586 619.2486 652.3446 685.3699 746.4131 750.1321 750.2895 762.0590 774.7631 776.3594 788.8825 794.1755 796.0481 799.3974 800.6008 806.8157 838.7832 867.1851 885.1794 911.9773 913.8447 927.6245 940.7433 960.7185 978.1898 980.3329 986.1082 988.7466 1018.7254 1021.7042 1033.9837 1045.3781 1069.6271 1073.3143 1073.9554 1074.8714 1077.1802 1084.3035 1084.3959 1106.8499 1120.5852 1130.5584 1145.7823 1165.8097 1173.3720 1175.9719 1203.6869 1208.0611 1211.3603 1222.1374 1242.0875 1252.9923 1259.8832 1278.4011 1279.8578 1284.0218 1287.5051 1289.1130 1294.6301 1297.5540 1320.6998 1326.2528 1357.7363 1360.0910 1361.9499 1363.3652 1365.4327 1373.1724 1376.0366 1384.6425 1387.1030 1387.5984 1387.6333 1390.5505 1411.8693 1420.9594 1447.8277 1460.8255 1461.9295 1462.9264 1463.1533 1469.0948 1470.2442 1473.0150 1473.6594 1477.7583 1478.8116 1484.6202 1485.9384 1486.4002 1487.1421 1490.7515 1491.2683 1497.4830 1516.1498 1571.4689 1607.3769 1640.0875 2852.2359 2854.0417 2860.1809 2862.3666 2879.9929 2897.2559 2978.9590 2981.4606 2983.1194 2984.1905 2992.7206 2996.2451 3015.0071 3018.3505 3031.3862 3032.5023 3038.8160 3045.3731 3061.1042 3067.2619 3071.1694 3074.0516 3075.6570 3076.6998 3089.7580 3090.2077 3091.8703 3092.4798 3111.0529 3116.3641 3119.2241 3135.8871 3147.1195 3157.6743 3163.9500
redmass: 3.4168 3.5123 3.9487 3.6473 4.0130 3.4965 2.4369 2.7958 2.6003 2.4348 2.3749 2.4377 4.1022 1.7125 1.6891 3.1221 2.4723 1.3566 1.7320 1.5916 1.6146 1.7168 2.6634 1.9989 2.1015 2.4890 2.7109 3.5781 2.7334 3.3594 3.0508 3.2069 3.4524 2.7104 2.8404 2.5726 2.5972 2.7240 6.7343 3.3193 3.4629 3.4217 6.2142 2.5488 4.2316 2.3224 1.4025 2.4586 4.3956 2.0201 1.2665 1.2328 1.1349 1.1507 1.2170 1.3159 1.4502 1.5084 4.7560 1.8798 1.9947 1.9332 4.5977 1.3434 1.4167 2.6114 1.3661 2.3513 2.3205 3.3491 2.2541 3.4564 1.8706 2.2756 2.4833 1.9871 1.9608 1.9666 2.2008 2.1333 1.8481 1.7537 1.7132 1.7112 1.2330 1.2133 1.5395 2.3084 2.2583 2.4325 1.9219 1.9138 1.4389 1.4994 1.1544 1.2097 1.5975 1.2362 1.2573 1.2045 1.1783 1.3071 1.3962 1.4618 1.4100 1.5227 1.3980 1.4742 1.6066 1.3596 1.2315 1.2613 1.2315 1.2339 1.4633 3.0646 3.9410 4.3607 1.0638 1.0530 1.0564 1.0576 1.0608 1.0769 1.6327 1.1522 1.1598 1.0608 1.0818 1.0728 1.1038 1.0682 1.0737 1.0746 1.1508 3.6198 6.7409 5.6674 6.7469 1.0718 1.0719 1.0716 1.0713 1.0717 1.0700 1.0359 1.0356 1.0358 1.0358 1.0612 1.0625 1.0873 1.0875 1.0874 1.0876 1.0888 1.0943 1.0979 1.0995 1.0983 1.0981 1.0982 1.0984 1.1005 1.1002 1.1003 1.1004 1.0858 1.0891 1.0883 1.0942 1.0894 1.0999 1.0930
irintensity: 0.0072 0.0230 0.1084 0.1096 0.1191 0.0983 0.1328 0.3547 0.2250 0.1340 0.0597 0.0358 0.4541 1.3115 1.5326 0.7270 0.9586 0.5019 0.6435 0.2371 0.3513 0.6803 0.4890 1.0688 1.9756 3.2006 0.4286 0.2146 1.4404 0.6480 4.2433 4.3430 6.6534 4.3909 3.1061 18.7628 12.1112 4.8710 0.4686 2.1567 1.7889 8.8191 3.9563 0.0609 1.1539 5.4230 43.1284 0.9432 2.7861 1.3285 4.0520 17.6646 5.5182 3.8793 7.9195 3.4594 40.0962 63.5199 5.6055 8.4217 0.8045 1.6057 0.8384 0.2269 7.2082 34.6809 2.0649 1.5521 4.3140 2.5590 6.9889 9.0756 8.7220 43.7674 17.2636 7.9833 28.2837 49.2855 3.9212 2.7101 32.6339 24.3267 4.6434 31.1823 6.2218 15.0111 63.4556 19.3155 27.8070 46.1779 2.4515 19.6712 15.4292 7.3664 12.3655 2.1494 8.5336 24.4045 21.0712 30.9196 8.4365 1.9947 37.5309 2.4474 3.9982 6.4154 4.7805 9.7348 82.8060 17.9898 20.6567 16.6575 22.9547 24.2946 1.3162 24.4335 6.6692 17.6468 10.1415 2.5921 1.6254 8.9648 2.6084 3.7508 39.2950 16.2645 16.4692 4.4649 8.7350 4.0610 11.9105 4.1473 17.1932 18.5003 30.0158 117.1711 20.9714 75.3494 248.9867 37.1216 30.7977 94.2734 162.6999 153.8411 89.8495 28.3804 26.1083 36.3033 37.2888 37.4611 65.7147 29.4753 20.9482 22.7232 16.6098 12.6498 3.7256 16.0784 76.8222 52.1290 66.4024 70.1761 68.3717 30.6554 33.0820 44.7854 48.2900 8.9900 0.2722 13.2200 35.6447 26.1302 49.5627 22.0366
temp: 298.150 k
press: 1.00000 atm
elementType: 7 7 7 6 6 6 6 6 6 6 6 6 6 6 6 6 6 6 6 6 6 6 6 6 6 1 1 1 1 1 1 1 1 1 1 1 1 1 1 1 1 1 1 1 1 1 1 1 1 1 1 1 1 1 1 1 1 1 1 1
symmnumber: 1
zpe: 1384359.9 jmol-1
zpe.correction: 0.527275 hartree
zpe.thermalcorrener: 0.554959 hartree
zpe.thermalcorrenthalpy: 0.555903 hartree
zpe.thermalcorrgfe: 0.465005 hartree
zpe.sumelectzpe: -1021.620647 hartree
zpe.sumelectthermal: -1021.592963 hartree
zpe.sumelectthermalent: -1021.592019 hartree
zpe.sumelectthermalfe: -1021.682917 hartree
dipole: 3.2224 0.8544 1.1709
dipole: 3.5334
quadrupole: -151.8647 -141.4436 -160.2879
quadrupole: -3.6542 0.2943 -0.3756
quadrupole: -0.6660 9.7552 -9.0892 -3.6542 0.2943 -0.3756
hfenergy: -1022.1479219 hartree
pointgroup: C01 [X(C22H35N3)]
dipole: -1.3029627 -0.0321954 -0.4834461 debye
polarizability: 388.7673594|6.6757658|288.6679921|-17.5551576|-3.3947217|169.0315769 unknown
InChI: InChI=1S/C22H35N3/c1-5-23(6-2)15-17-25(18-16-24(7-3)8-4)22-14-13-20-11-9-10-12-21(20)19-22/h9-14,19H,5-8,15-18H2,1-4H3
charge 0 multiplicity 1
60 atoms
N  -0.538691 -0.135546 0.795418
N  -1.461416 3.422301 -0.28634
N  -3.217877 -2.704327 -0.169407
C  -0.945724 1.277547 0.898635
C  -1.581093 -1.167574 0.943671
C  -1.117212 1.99342 -0.471554
C  -2.181361 -1.668066 -0.400075
C  0.800736 -0.46865 0.528044
C  -0.8484 4.323878 -1.297981
C  -2.921224 3.646065 -0.105491
C  -4.344712 -2.638089 -1.138517
C  -2.639432 -4.070413 -0.039111
C  1.814608 0.514411 0.422582
C  1.195246 -1.852398 0.361238
C  3.178587 0.168743 0.178346
C  3.556159 -1.221584 0.024749
C  2.519976 -2.205864 0.125094
C  0.663998 4.524856 -1.082095
C  -3.243163 4.908691 0.71719
C  -5.301048 -1.461531 -0.86446
C  -3.521678 -5.02611 0.786681
C  4.207636 1.168125 0.076578
C  4.924754 -1.560979 -0.222682
C  5.536095 0.809336 -0.164373
C  5.903445 -0.566855 -0.316527
H  -1.901134 1.319036 1.45247
H  -0.214388 1.853802 1.495891
H  -1.188025 -2.02592 1.520955
H  -2.408683 -0.750419 1.544148
H  -1.882795 1.451738 -1.079277
H  -0.16663 1.916317 -1.026755
H  -1.362644 -2.032384 -1.06604
H  -2.641358 -0.806161 -0.915459
H  -1.3471 5.307026 -1.217013
H  -1.036384 3.958412 -2.339406
H  -3.33398 2.767465 0.425649
H  -3.449866 3.691794 -1.091827
H  -4.916854 -3.579608 -1.053361
H  -3.97405 -2.587749 -2.19379
H  -1.6606 -3.97492 0.468285
H  -2.427653 -4.519848 -1.04277
H  1.577237 1.576481 0.537394
H  0.443747 -2.644785 0.417056
H  2.781735 -3.264666 0.006027
H  0.851151 4.939133 -0.075964
H  1.222589 3.575249 -1.172236
H  1.072766 5.222869 -1.836392
H  -2.76918 4.843957 1.711955
H  -2.874111 5.826637 0.225078
H  -4.336132 5.017023 0.849111
H  -5.715048 -1.539939 0.155847
H  -4.789799 -0.484891 -0.951218
H  -6.136829 -1.46498 -1.589001
H  -3.692113 -4.608961 1.794355
H  -4.507633 -5.190272 0.315603
H  -3.032423 -6.01294 0.887436
H  3.934132 2.224321 0.19387
H  5.19563 -2.618056 -0.337368
H  6.30759 1.584507 -0.238168
H  6.949226 -0.833052 -0.505103
