program: Gaussian 09
title: 000283984
version: EM64L-G09RevD.01
frameworkgroup: C1[X(C12H22O4)]
method: RPBEPBE
basis: SDD
operation: Freq
keyword: #pfreq=noraman
keyword: PBEPBE/SDD
title: #p freq=noraman PBEPBE/SDD
converged: YES YES NO NO
title: Mulliken charges:
elementType: O O O O C C C C C C C C C C C C H H H H H H H H H H H H H H H H H H H H H H
charge: -0.267196 -0.267161 -0.221992 -0.222272 0.364527 0.364468 -0.036141 -0.036242 -0.418325 -0.418305 -0.341695 -0.341712 -0.733886 -0.734958 -0.733531 -0.734109 0.201943 0.201777 0.227610 0.197831 0.197827 0.227545 0.190117 0.232445 0.232339 0.190074 0.231477 0.232926 0.198182 0.246754 0.216341 0.214061 0.232886 0.231456 0.198163 0.246388 0.214269 0.216117
chargesum: 0.00000
title: Mulliken charges with hydrogens summed into heavy atoms:
elementType: O O O O C C C C C C C C C C C C
charge: -0.267196 -0.267161 -0.221992 -0.222272 0.364527 0.364468 0.165802 0.165535 0.007116 0.007067 0.080868 0.080700 -0.071301 -0.057802 -0.071025 -0.057334
polarizability: 1.68282245e+02 -1.25798084e+00 1.35544143e+02 -2.62469041e-02 3.31461351e-01 1.19297936e+02
1716.lowfreq: -22.8056 -11.5514 -0.0006 0.0000 0.0006 6.5869 14.9091 54.9322 82.6221
frequency: 14.9005 54.9317 82.6218 125.1216 142.2719 146.6555 153.9065 158.1606 193.4032 199.9848 210.6578 248.6499 268.9251 284.7887 300.8710 312.7256 317.7697 350.7062 386.5485 417.2023 422.0202 445.0477 460.7961 467.5925 492.7702 522.7507 540.5851 633.1556 658.6739 700.4537 729.3988 796.9448 820.6444 836.2539 852.5188 897.9167 910.1067 926.2778 926.5948 927.5593 932.4120 950.1873 961.7009 973.4781 975.7649 999.5155 999.7948 1040.7393 1041.0385 1046.5891 1054.3560 1138.9915 1139.5010 1152.4305 1186.0944 1209.3402 1221.7155 1224.6379 1236.9322 1241.7970 1260.2675 1261.5786 1289.2174 1295.7282 1300.4746 1342.0672 1343.3639 1353.5137 1355.9617 1372.4225 1373.4786 1388.8826 1389.1151 1401.3593 1434.8498 1434.9987 1452.2226 1452.3313 1460.9971 1461.5600 1468.7867 1468.9830 1473.8493 1474.8120 1486.1770 1486.3334 2947.5311 2950.4334 2951.8368 2961.7573 2985.5761 2985.8318 2987.8244 2987.8502 2993.6046 2993.9228 3058.5105 3058.6798 3077.7817 3077.8680 3084.3774 3085.1149 3087.1817 3087.2856 3094.5068 3094.5599 3097.5257 3097.6183
redmass: 3.5958 3.3753 3.9996 3.2622 2.1613 1.3276 1.2843 1.9858 1.3510 1.0848 2.3251 2.3313 3.0792 2.5673 2.2158 3.0701 3.0301 2.5691 2.2206 2.6639 3.0046 2.8664 3.3427 3.6236 3.7448 3.2436 3.9588 3.4730 2.7421 3.6419 3.3244 3.0027 3.8493 3.8441 2.7824 2.4029 2.5383 1.5001 1.5199 3.8629 3.8138 2.4370 2.0519 1.5455 1.5436 2.0567 2.1265 1.7082 2.0447 2.6365 4.8050 1.8033 1.8759 2.3486 1.5564 1.7763 1.6508 1.4666 1.7791 1.9120 2.0688 2.0949 1.2544 1.2576 1.1669 1.4762 1.4850 1.2556 1.2645 1.2526 1.2554 1.2145 1.2123 1.9465 1.0854 1.0872 1.0587 1.0588 1.0733 1.0824 1.0557 1.0560 1.0692 1.0737 1.0547 1.0546 1.0797 1.0695 1.0703 1.0823 1.0360 1.0365 1.0414 1.0416 1.0543 1.0542 1.1009 1.1009 1.0984 1.0985 1.0965 1.0966 1.0994 1.0994 1.0999 1.0999 1.0997 1.0996
irintensity: 0.5202 5.4443 3.0250 0.0000 0.0063 0.8298 0.1163 2.0491 0.0011 0.4982 0.0002 5.4881 0.0001 0.0002 0.6956 0.0006 4.1589 0.0001 2.0162 4.4269 0.0002 0.0001 0.0031 7.9944 4.8339 0.0005 17.9913 0.0003 9.6963 13.6130 0.0003 22.7638 29.1615 0.0027 0.0004 44.7020 0.0196 6.8052 3.3517 0.1057 163.7769 0.0699 60.8257 0.0085 21.1533 29.3802 44.3009 34.4036 3.4676 0.0089 229.4486 0.0537 109.2067 0.0022 73.5935 0.0018 22.8621 0.0054 37.9543 0.0206 62.8171 1.5871 3.1256 11.6126 0.0005 0.2201 23.1561 16.7829 0.0363 0.1733 67.9096 43.0488 0.0134 0.0001 10.1592 1.7618 15.5534 0.0123 1.4299 0.0314 0.2923 8.2362 29.1674 0.3695 15.6453 8.2795 0.1027 85.8931 2.4441 108.0624 0.0017 66.0876 2.8366 18.1365 80.8887 0.5530 26.5490 26.0464 27.4136 37.1626 33.2084 27.7544 52.6448 0.2592 9.8158 50.0564 4.6463 63.1479
temp: 298.150 k
press: 1.00000 atm
elementType: 8 8 8 8 6 6 6 6 6 6 6 6 6 6 6 6 1 1 1 1 1 1 1 1 1 1 1 1 1 1 1 1 1 1 1 1 1 1
symmnumber: 1
zpe: 855906.5 jmol-1
zpe.correction: 0.325998 hartree
zpe.thermalcorrener: 0.343350 hartree
zpe.thermalcorrenthalpy: 0.344294 hartree
zpe.thermalcorrgfe: 0.281409 hartree
zpe.sumelectzpe: -770.032512 hartree
zpe.sumelectthermal: -770.015160 hartree
zpe.sumelectthermalent: -770.014215 hartree
zpe.sumelectthermalfe: -770.077100 hartree
dipole: -0.0081 0.0124 0.0046
dipole: 0.0155
quadrupole: -75.6890 -99.2908 -97.2029
quadrupole: 7.0951 3.7518 0.9065
quadrupole: 15.0386 -8.5633 -6.4753 7.0951 3.7518 0.9065
hfenergy: -770.3585091 hartree
pointgroup: C01 [X(C12H22O4)]
dipole: -0.0027774 -0.0006554 0.0053804 debye
polarizability: 167.8897589|0.6578771|120.0451152|-3.8153897|3.3573937|135.1894512 unknown
InChI: InChI=1S/C12H22O4/c1-11(2)5-7-13-9(15-11)10-14-8-6-12(3,4)16-10/h9-10H,5-8H2,1-4H3
charge 0 multiplicity 1
38 atoms
O  1.629258 0.377168 -0.927964
O  -1.555447 -0.016826 0.843157
O  1.033284 0.847048 1.356279
O  -0.961576 -0.484448 -1.442375
C  3.086854 0.150719 -0.624195
C  -3.014499 0.208589 0.542366
C  0.752517 0.029097 0.179733
C  -0.680225 0.332566 -0.263993
C  3.425107 0.896277 0.699251
C  -3.352746 -0.537236 -0.78058
C  2.411257 0.575249 1.81611
C  -2.340716 -0.214057 -1.898595
C  3.803718 0.790088 -1.822147
C  3.386403 -1.365246 -0.55261
C  -3.727842 -0.431917 1.741536
C  -3.31612 1.724003 0.472103
H  0.853525 -1.047119 0.442645
H  -0.781068 1.408743 -0.526982
H  3.397785 1.983729 0.50194
H  4.448764 0.632405 1.030312
H  -4.377218 -0.275888 -1.111146
H  -3.322674 -1.624652 -0.583339
H  2.486537 -0.484851 2.142856
H  2.557862 1.225329 2.693278
H  -2.488631 -0.863566 -2.776063
H  -2.418423 0.846179 -2.224475
H  3.544852 0.255741 -2.75286
H  3.491373 1.842846 -1.931913
H  4.899828 0.754774 -1.684279
H  2.947924 -1.868805 -1.431445
H  4.478677 -1.535149 -0.560651
H  2.980642 -1.843682 0.356191
H  -3.415378 -1.484834 1.849478
H  -3.466333 0.101537 2.672023
H  -4.824341 -0.396505 1.606858
H  -2.885571 2.2266 1.355346
H  -2.904148 2.205264 -0.432324
H  -4.408814 1.891733 0.471672
