program: Gaussian 09
title: 000025054
version: EM64L-G09RevD.01
frameworkgroup: C1[X(C10H22O4)]
method: RPBEPBE
basis: SDD
operation: Freq
keyword: #pfreq=noraman
keyword: PBEPBE/SDD
title: #p freq=noraman PBEPBE/SDD
converged: YES YES NO NO
title: Mulliken charges:
elementType: O O O O C C C C C C C C C C H H H H H H H H H H H H H H H H H H H H H H
charge: -0.362050 -0.296360 -0.292715 -0.493084 0.080053 -0.339496 -0.233751 0.005169 0.028066 -0.694688 -0.315212 -0.702211 -0.704114 -0.530791 0.176518 0.223888 0.199145 0.219309 0.178944 0.203829 0.189906 0.260156 0.214179 0.213285 0.188467 0.190262 0.226703 0.206787 0.224073 0.230144 0.202264 0.222479 0.225300 0.188786 0.256846 0.409915
chargesum: 0.00000
title: Mulliken charges with hydrogens summed into heavy atoms:
elementType: O O O O C C C C C C C C C C
charge: -0.362050 -0.296360 -0.292715 -0.083169 0.256571 0.083536 0.164502 0.208998 0.217972 -0.007068 0.063517 -0.044647 -0.049227 0.140140
polarizability: 1.43459840e+02 4.27129767e+00 1.32820610e+02 -3.17099102e+00 -3.31646044e+00 1.02263653e+02
1716.lowfreq: -9.3915 -3.7042 0.0004 0.0004 0.0005 5.9587 23.4297 32.8759 61.9435
frequency: 23.3916 31.6103 61.9096 73.1810 74.5830 93.9192 120.5282 131.0313 174.5207 181.0595 193.8092 206.3016 210.2998 220.5855 233.2763 261.7230 287.7722 305.6536 319.9266 352.9268 380.7911 416.5464 428.9936 472.7733 504.3280 524.7537 611.0298 746.9593 765.8218 806.6395 836.8399 871.7095 889.6952 903.5980 915.9516 924.0715 931.7398 978.5393 1014.7711 1020.4067 1033.6599 1062.8282 1069.2189 1084.3771 1098.9488 1109.1241 1124.9727 1127.8745 1134.0015 1144.4380 1154.0627 1161.9053 1219.3092 1230.9049 1253.3435 1283.4905 1292.8095 1318.7397 1321.1590 1327.9181 1336.5442 1362.3925 1373.3281 1379.4444 1385.4069 1388.1608 1391.4337 1435.3083 1442.8018 1445.5423 1448.9287 1456.6969 1460.6889 1464.2744 1466.8915 1469.8847 1475.1519 1477.1821 1477.5132 1480.8768 2920.7842 2930.8828 2948.2275 2950.0926 2960.7050 2962.6805 2967.5130 2982.8462 2989.2089 2995.2246 3021.4986 3028.6394 3032.3900 3042.3380 3079.8355 3083.6889 3085.9298 3088.9127 3097.5429 3098.1415 3115.9866 3178.8418
redmass: 3.5126 3.6611 4.1144 3.6013 4.2635 2.7087 2.7765 2.7961 2.4362 1.1017 1.7741 1.2519 1.6998 1.1437 2.7389 3.0919 2.7102 3.5001 2.2664 3.2084 2.4149 2.9718 2.7511 3.0937 3.5263 2.8098 2.8931 3.3158 2.8582 1.9889 1.3063 1.9998 1.9488 2.0839 1.4098 1.6588 1.5717 2.8238 4.6458 4.7632 5.1689 2.1192 2.3510 1.9562 2.0506 2.5347 1.2930 2.1604 1.9702 2.0290 2.1042 1.3506 1.1418 1.2271 1.1514 1.3627 1.2657 1.4635 1.2516 1.3038 1.2355 1.3044 1.2612 1.3554 1.2364 1.2836 1.2800 1.0971 1.1288 1.1224 1.0783 1.0736 1.0475 1.0520 1.0528 1.0483 1.0596 1.0506 1.0548 1.0555 1.0812 1.0350 1.0649 1.0615 1.0627 1.0839 1.0792 1.0360 1.0359 1.0371 1.1019 1.1014 1.1036 1.0991 1.0991 1.0985 1.0993 1.1001 1.0988 1.0999 1.1001 1.0702
irintensity: 1.8803 0.5917 0.7842 3.7201 3.5523 8.6747 8.2150 6.9066 3.0128 0.5206 1.2381 0.6962 1.2209 0.1795 0.3170 7.1221 8.1901 0.7246 4.2519 0.3223 3.2403 7.5361 11.1188 8.9067 5.8020 6.8726 4.1833 1.3309 6.1732 9.8563 107.1634 5.2438 8.7778 5.7452 1.3947 1.0398 0.8170 72.7694 83.6023 104.7879 117.5103 83.4515 6.3028 31.0136 30.0552 31.3230 5.5999 18.1340 7.8498 8.9473 59.8402 1.6477 23.3910 2.5295 10.0400 0.8507 7.8357 5.5416 15.5158 20.1938 14.7327 2.7238 14.0053 9.2056 32.3130 6.1254 27.4875 34.9149 1.8974 7.9653 4.3441 1.8229 12.0150 8.1365 3.4912 14.0978 4.3528 9.5926 14.7035 21.9542 48.3087 88.6376 94.9976 25.4014 51.3920 21.4022 102.0262 31.4837 26.8135 25.9066 31.9987 26.7676 31.5512 76.9787 36.5543 38.0667 42.8011 28.1946 27.3721 31.7753 16.6380 553.3327
temp: 298.150 k
press: 1.00000 atm
elementType: 8 8 8 8 6 6 6 6 6 6 6 6 6 6 1 1 1 1 1 1 1 1 1 1 1 1 1 1 1 1 1 1 1 1 1 1
symmnumber: 1
zpe: 820862.0 jmol-1
zpe.correction: 0.312650 hartree
zpe.thermalcorrener: 0.330730 hartree
zpe.thermalcorrenthalpy: 0.331675 hartree
zpe.thermalcorrgfe: 0.265810 hartree
zpe.sumelectzpe: -693.917004 hartree
zpe.sumelectthermal: -693.898924 hartree
zpe.sumelectthermalent: -693.897979 hartree
zpe.sumelectthermalfe: -693.963844 hartree
dipole: 0.7033 2.0476 -1.0898
dipole: 2.4238
quadrupole: -81.3454 -79.8472 -89.8611
quadrupole: 2.3843 -1.4874 -4.0013
quadrupole: 2.3392 3.8374 -6.1766 2.3843 -1.4874 -4.0013
hfenergy: -694.2296539 hartree
pointgroup: C01 [X(C10H22O4)]
dipole: 0.4224507 -0.7997692 0.3020861 debye
polarizability: 144.7932755|-2.7030897|131.9117985|1.1491429|1.4549044|101.8390281 unknown
InChI: InChI=1S/C10H22O4/c1-8(5-11)13-7-10(3)14-6-9(2)12-4/h8-11H,5-7H2,1-4H3
charge 0 multiplicity 1
36 atoms
O  0.689241 -0.954602 0.135211
O  -2.330703 -1.090787 -0.177854
O  2.366177 1.300416 -0.825895
O  -0.655266 1.168791 1.049883
C  -0.103827 -2.19188 -0.046275
C  -1.458555 -1.939907 0.642006
C  2.103418 -1.019063 -0.24923
C  2.765919 0.294473 0.176566
C  -2.858789 0.147068 0.456066
C  -0.248924 -2.580691 -1.526663
C  -1.877063 1.323829 0.270728
C  4.301487 0.17497 0.233394
C  -4.213085 0.412867 -0.213118
C  2.179203 2.6434 -0.263516
H  0.410808 -3.006445 0.515901
H  -1.282021 -1.489646 1.638206
H  -1.965975 -2.918313 0.771902
H  2.207886 -1.133625 -1.345828
H  2.582517 -1.883027 0.260697
H  2.367403 0.579878 1.174314
H  -2.987956 -0.032216 1.545388
H  -0.757181 -1.7715 -2.075028
H  -0.86379 -3.495171 -1.615296
H  0.730585 -2.783909 -1.993439
H  -1.660695 1.437115 -0.81401
H  -2.356024 2.251742 0.635352
H  4.752068 1.161387 0.441566
H  4.622321 -0.522567 1.029688
H  4.699265 -0.181132 -0.733917
H  -4.89352 -0.441289 -0.058207
H  -4.683751 1.322495 0.202652
H  -4.081786 0.552564 -1.301455
H  1.911309 3.288505 -1.115913
H  3.109453 3.032462 0.202973
H  1.352984 2.641995 0.47532
H  -0.101131 0.424709 0.64893
