program: Gaussian 09
title: 000283972
version: EM64L-G09RevD.01
frameworkgroup: C1[X(C20H12O2)]
method: RPBEPBE
basis: SDD
operation: Freq
keyword: #pfreq=noraman
keyword: PBEPBE/SDD
title: #p freq=noraman PBEPBE/SDD
converged: NO NO NO NO
title: Mulliken charges:
elementType: O O C C C C C C C C C C C C C C C C C C C C H H H H H H H H H H H H
charge: -0.246523 -0.250103 0.170652 0.084194 0.125446 0.246326 0.240803 0.202285 0.317879 0.444313 -0.420432 -0.434320 -0.374074 -0.441778 -0.382400 -0.391564 -0.435437 -0.433332 -0.241611 -0.242787 -0.235119 -0.234522 0.254363 0.248436 0.262052 0.249120 0.256073 0.264255 0.241108 0.246691 0.220593 0.235876 0.220296 0.233240
chargesum: 0.00000
title: Mulliken charges with hydrogens summed into heavy atoms:
elementType: O O C C C C C C C C C C C C C C C C C C C C
charge: -0.246523 -0.250103 0.170652 0.084194 0.125446 0.246326 0.240803 0.202285 0.317879 0.444313 -0.166068 -0.185883 -0.112022 -0.192658 -0.126328 -0.127309 -0.194329 -0.186640 -0.021018 -0.022492 0.000758 -0.001282
polarizability: 4.59610762e+02 1.00143672e+01 2.41131386e+02 -1.28833455e-02 -3.89296975e-03 8.24505637e+01
1716.lowfreq: -0.0011 -0.0008 0.0005 2.5396 4.9953 17.1045 35.6932 58.2834 58.3747
frequency: 35.5672 58.2759 58.3538 105.3508 150.8634 154.4080 166.3039 227.9721 257.2545 274.2947 285.4251 316.4351 320.1020 421.1790 423.8364 440.9583 458.8659 493.3876 502.9993 520.7613 545.6535 556.0000 572.6671 581.3723 611.0159 633.1393 652.3054 657.9633 690.5519 733.8357 744.7322 748.7015 755.4065 763.8640 772.6998 775.1128 803.3322 814.9639 853.7966 859.0261 880.9683 882.4652 925.9637 936.4296 945.8023 947.2879 971.6431 972.6761 980.2410 997.2773 1007.1165 1017.4738 1024.0658 1056.5207 1071.8913 1109.2445 1127.4936 1140.1183 1157.1186 1168.5072 1176.0383 1212.1459 1224.9827 1239.4320 1254.0376 1269.9116 1304.8300 1339.2460 1369.8252 1401.0775 1402.1754 1425.3069 1442.9935 1448.0509 1449.7986 1455.3574 1516.3119 1530.0390 1581.0628 1585.9250 1605.0786 1613.5016 1651.0644 1704.7735 3118.6365 3127.2138 3130.9855 3140.2391 3146.8367 3147.3312 3155.0553 3161.5434 3169.5978 3170.9974 3185.1459 3202.2211
redmass: 6.3912 5.5630 4.4344 4.9553 6.1159 6.4546 4.9567 4.0444 5.2560 6.1531 5.2909 5.8341 6.3579 3.1212 2.9085 4.6764 7.3736 6.9126 3.6629 6.1535 5.8736 3.7940 3.2622 6.8901 6.7765 6.9282 4.0958 4.7309 6.9876 6.8921 6.2746 1.8203 1.3954 1.3817 2.6810 11.9390 1.8818 1.4188 5.0442 4.7455 1.4938 1.5383 1.3218 6.7804 1.3350 1.4177 7.3325 1.3912 1.3177 1.3375 6.7384 2.1873 2.4510 3.8556 1.5380 1.5471 2.0345 1.3559 1.8952 1.1148 1.0968 2.5242 1.6881 2.1279 3.4979 1.8285 1.9530 2.4356 2.1418 3.4788 4.9737 5.3118 2.9618 2.6439 2.5435 3.8313 5.0283 4.9970 7.2516 6.4690 6.7634 7.3125 8.4589 11.4128 1.0851 1.0868 1.0903 1.0890 1.0898 1.0949 1.0951 1.0990 1.1006 1.0894 1.0964 1.1046
irintensity: 0.4292 0.1117 0.1190 0.0089 0.1032 0.3944 0.2614 8.0773 0.2165 0.4253 0.2686 0.1948 3.8381 2.9739 10.0024 1.5153 0.4237 1.8021 1.4070 0.3725 0.2490 14.6561 4.5053 4.7883 2.2206 2.8916 0.4046 3.7911 27.7823 53.0790 0.6055 6.4603 15.3244 99.3094 19.8897 105.5949 39.7289 104.9962 7.5120 4.6679 5.1247 1.3147 0.0819 127.7716 0.5421 5.9868 231.9421 3.7278 0.0036 0.0000 57.3640 4.8865 25.1436 52.1436 5.8268 50.4745 14.2974 3.1918 3.0205 1.9423 0.1718 24.9780 44.4788 43.9493 179.4070 66.4724 4.4795 23.0668 142.8735 10.9710 12.2586 2.7885 13.8761 4.8460 41.1006 77.4213 16.2315 7.9790 11.0166 1.9722 10.6646 2.0762 79.4199 1010.7980 0.6007 1.5061 15.1519 6.7857 6.6978 40.6058 21.6390 28.5540 24.6917 3.3163 1.9774 10.5214
temp: 298.150 k
press: 1.00000 atm
elementType: 8 8 6 6 6 6 6 6 6 6 6 6 6 6 6 6 6 6 6 6 6 6 1 1 1 1 1 1 1 1 1 1 1 1
symmnumber: 1
zpe: 670972.3 jmol-1
zpe.correction: 0.255560 hartree
zpe.thermalcorrener: 0.271203 hartree
zpe.thermalcorrenthalpy: 0.272147 hartree
zpe.thermalcorrgfe: 0.212208 hartree
zpe.sumelectzpe: -918.292677 hartree
zpe.sumelectthermal: -918.277034 hartree
zpe.sumelectthermalent: -918.276090 hartree
zpe.sumelectthermalfe: -918.336029 hartree
dipole: -4.6714 0.8431 0.0002
dipole: 4.7468
quadrupole: -105.8744 -109.8661 -135.0013
quadrupole: -1.8913 -0.0008 -0.0005
quadrupole: 11.0395 7.0478 -18.0874 -1.8913 -0.0008 -0.0005
hfenergy: -918.5482367 hartree
pointgroup: C01 [X(C20H12O2)]
dipole: 1.8383293 0.3290655 -0.0000724 debye
polarizability: 459.581498|-10.3286146|241.1606504|-0.0128777|0.0039115|82.4505637 unknown
InChI: InChI=1S/C20H12O2/c1-3-7-15-13(5-1)9-11-17(15)20-21-18-12-10-14-6-2-4-8-16(14)19(18)22-20/h1-12H
charge 0 multiplicity 1
34 atoms
O  0.581437 -0.991183 0.000292
O  -0.267014 1.17413 0.000368
C  -1.871277 -0.712172 0.000401
C  1.661843 -0.067126 0.000266
C  -3.142401 0.038185 0.000457
C  3.047241 -0.355157 0.000204
C  -0.603175 -0.205235 0.000353
C  1.155888 1.229147 0.000313
C  -4.199217 -0.942101 0.000449
C  3.916807 0.81204 0.000194
C  -2.208986 -2.14535 0.000382
C  -3.586172 -2.278735 0.000388
C  1.979598 2.374737 0.000306
C  3.363115 2.140806 0.000246
C  -3.438771 1.416554 0.000493
C  3.603869 -1.6756 0.000151
C  -5.548981 -0.53194 0.000478
C  5.335489 0.591074 0.00013
C  -4.800126 1.817056 0.000521
C  -5.842476 0.855354 0.000514
C  4.989409 -1.842448 0.000089
C  5.860601 -0.702454 0.000079
H  -1.463588 -2.942779 0.000361
H  -4.146208 -3.217132 0.000368
H  1.553652 3.380679 0.000344
H  4.053182 2.991273 0.000238
H  -2.640535 2.165757 0.000497
H  2.928541 -2.537131 0.000159
H  -6.36064 -1.268901 0.000471
H  6.002271 1.461404 0.000121
H  -5.048818 2.884758 0.00055
H  5.422503 -2.848348 0.000047
H  -6.886839 1.189086 0.000536
H  6.944879 -0.857449 0.000031
