program: Gaussian 09
title: 000283965
version: EM64L-G09RevD.01
frameworkgroup: C1[X(C16H14N2)]
method: RPBEPBE
basis: SDD
operation: Freq
keyword: #pfreq=noraman
keyword: PBEPBE/SDD
title: #p freq=noraman PBEPBE/SDD
converged: YES YES NO NO
title: Mulliken charges:
elementType: N N C C C C C C C C C C C C C C C C H H H H H H H H H H H H H H
charge: -0.441401 -0.085018 -0.660175 0.457520 0.447320 0.062347 -0.548066 0.342593 -0.444842 -0.363550 -0.376091 -0.369719 -0.218933 -0.225721 -0.244916 -0.249008 -0.233821 -0.242475 0.244133 0.231282 0.249994 0.336668 0.234839 0.245599 0.219433 0.268860 0.228866 0.229957 0.231932 0.222433 0.223845 0.226115
chargesum: 0.00000
title: Mulliken charges with hydrogens summed into heavy atoms:
elementType: N N C C C C C C C C C C C C C C C C
charge: -0.104733 -0.085018 -0.184760 0.457520 0.447320 0.062347 -0.298071 0.342593 -0.210003 -0.117951 -0.156658 -0.100859 0.009933 0.004236 -0.012984 -0.026575 -0.009977 -0.016360
polarizability: 2.90054435e+02 -6.87120291e+00 1.48940297e+02 -2.25476644e+01 3.66137019e+00 1.19155025e+02
1716.lowfreq: -7.3284 -3.3190 -0.0005 -0.0003 0.0005 7.3123 13.4786 22.5751 30.9639
frequency: 10.0888 21.9982 30.7825 57.0020 97.9248 111.4505 199.4008 211.6137 246.1091 313.0870 322.5920 376.1901 402.7659 404.2150 455.5090 465.9957 503.8767 576.6940 609.8634 616.0880 621.9705 651.8708 674.8779 691.0624 700.0091 702.8866 719.8493 769.8489 780.3753 805.2802 826.0908 854.3091 858.1293 908.1649 928.1731 932.3759 945.4012 979.9275 980.4374 988.8346 990.4107 998.5931 1000.2212 1015.9187 1019.9068 1026.8314 1048.1756 1077.5010 1082.8303 1134.2006 1169.7458 1171.7549 1174.3858 1188.1326 1189.2505 1192.0360 1211.6867 1268.4330 1289.7661 1317.2234 1333.4232 1365.7297 1382.2864 1382.9349 1414.0406 1431.6534 1441.1136 1448.6834 1464.2727 1484.2991 1515.4002 1561.5350 1588.6458 1594.2306 1614.0877 1619.5880 2978.2230 3027.7161 3117.8442 3121.4884 3122.2725 3129.8487 3135.8041 3143.0144 3147.4593 3156.1027 3165.2810 3167.2007 3227.2500 3603.5142
redmass: 4.1513 4.4957 4.5079 4.7696 4.4778 5.0246 4.0793 4.8641 5.2921 2.8760 3.7842 5.4065 2.8180 2.8156 4.7280 3.3305 3.5511 5.1420 4.1503 6.4013 3.5373 1.6245 3.8982 2.3976 2.0785 2.7258 1.8367 2.2243 1.8218 3.1151 1.7736 1.2537 1.2461 1.4965 1.4727 7.1949 1.7787 1.3922 1.3699 6.2239 6.1451 1.3170 1.3294 3.7451 3.2228 2.2043 1.9690 1.7043 1.5866 2.7420 1.1825 1.0691 1.0843 1.2016 1.1427 2.0840 2.0638 2.7187 1.7180 1.3714 1.3047 2.3210 7.0879 6.7752 3.2812 2.5773 2.0724 2.5023 1.2070 2.1840 3.7883 4.9042 6.1186 6.0611 6.0926 6.0793 1.0619 1.0982 1.0874 1.0844 1.0870 1.0879 1.0910 1.0934 1.0959 1.0963 1.1015 1.1000 1.0985 1.0819
irintensity: 0.0900 0.0538 0.3221 0.1075 2.5796 0.8712 2.7699 0.6633 0.7044 1.9267 0.2489 0.1065 0.0082 0.2481 3.6743 11.3729 7.9509 2.2871 2.9511 0.1074 8.5129 40.8142 12.6707 41.3644 33.0510 14.0644 67.7943 35.3330 69.0589 10.6949 19.7726 0.7265 0.0466 3.7647 6.1649 12.3041 3.8050 0.0911 0.0982 0.7057 0.4857 0.4332 0.7988 3.7306 13.2868 12.9786 2.8302 16.8994 13.0472 11.0948 3.6671 1.4011 1.3980 4.0868 0.3658 3.8406 0.9728 31.0852 1.7546 7.1984 1.3677 1.2743 0.2853 1.7567 16.7357 18.6762 8.3009 28.8992 13.0820 15.6848 13.9201 48.9414 2.9813 0.8680 9.0306 12.8930 25.0105 8.2393 8.0619 4.2138 4.0367 5.1406 9.7121 37.4486 37.4550 27.8226 24.6574 16.8339 1.0973 77.9622
temp: 298.150 k
press: 1.00000 atm
elementType: 7 7 6 6 6 6 6 6 6 6 6 6 6 6 6 6 6 6 1 1 1 1 1 1 1 1 1 1 1 1 1 1
symmnumber: 1
zpe: 674724.1 jmol-1
zpe.correction: 0.256989 hartree
zpe.thermalcorrener: 0.271515 hartree
zpe.thermalcorrenthalpy: 0.272460 hartree
zpe.thermalcorrgfe: 0.211632 hartree
zpe.sumelectzpe: -726.359166 hartree
zpe.sumelectthermal: -726.344639 hartree
zpe.sumelectthermalent: -726.343695 hartree
zpe.sumelectthermalfe: -726.404523 hartree
dipole: 2.9318 1.2114 0.2106
dipole: 3.1792
quadrupole: -91.6277 -99.7715 -104.6909
quadrupole: -3.7631 -5.9361 0.3160
quadrupole: 7.0690 -1.0748 -5.9942 -3.7631 -5.9361 0.3160
hfenergy: -726.6161548 hartree
pointgroup: C01 [X(C16H14N2)]
dipole: 1.176559 -0.0140227 0.4242571 debye
polarizability: 286.469637|30.4678274|121.5968193|-13.6854339|-4.6874317|150.0833003 unknown
InChI: InChI=1S/C16H14N2/c1-3-7-13(8-4-1)11-15-12-16(18-17-15)14-9-5-2-6-10-14/h1-10,12,17H,11H2
charge 0 multiplicity 1
32 atoms
N  0.436998 0.86735 -0.544657
N  -0.883355 0.74744 -0.944391
C  2.041234 0.434004 1.380313
C  0.681548 0.367185 0.72588
C  3.214447 0.14594 0.440845
C  -1.503827 0.152352 0.132058
C  -0.558628 -0.099905 1.185969
C  -2.949559 -0.140951 0.090587
C  4.31727 1.033285 0.372229
C  3.232842 -1.026117 -0.360625
C  -3.601794 -0.771991 1.184061
C  -3.720422 0.206462 -1.053808
C  5.417953 0.757093 -0.472471
C  4.329897 -1.305045 -1.204099
C  5.427916 -0.413949 -1.263159
C  -4.985123 -1.048296 1.136373
C  -5.101516 -0.070279 -1.099791
C  -5.742872 -0.699306 -0.005339
H  2.042867 -0.291477 2.216095
H  2.185221 1.431135 1.842046
H  -0.747633 -0.557415 2.154593
H  1.117376 1.251106 -1.198285
H  4.316456 1.944272 0.983931
H  2.382558 -1.718204 -0.322596
H  -3.028922 -1.049523 2.076124
H  -3.216824 0.693083 -1.895028
H  6.262375 1.454254 -0.512886
H  4.329733 -2.21515 -1.814426
H  6.278894 -0.630011 -1.918539
H  -5.471521 -1.535741 1.989015
H  -5.680785 0.20429 -1.988809
H  -6.816803 -0.913787 -0.042112
