program: Gaussian 09
title: 000283943
version: EM64L-G09RevD.01
frameworkgroup: C1[X(C7H13NO2)]
method: RPBEPBE
basis: SDD
operation: Freq
keyword: #p
keyword: freq=noraman
keyword: PBEPBE/SDD
title: #p freq=noraman PBEPBE/SDD
converged: NO NO NO NO
title: Mulliken charges:
elementType: O O N C C C C C C C H H H H H H H H H H H H H
charge: -0.278646 -0.269095 -0.317037 0.045134 0.028048 -0.395365 -0.462488 0.122567 -0.716218 -0.715803 0.196644 0.195535 0.217182 0.229636 0.236569 0.224984 0.319560 0.202171 0.242974 0.223442 0.210336 0.223129 0.236744
chargesum: 0.00000
title: Mulliken charges with hydrogens summed into heavy atoms:
elementType: O O N C C C C C C C
charge: -0.278646 -0.269095 0.002522 0.241778 0.223583 0.051452 -0.000935 0.122567 -0.047632 -0.045594
polarizability: 1.02196087e+02 -5.55069467e+00 9.22251676e+01 3.08543721e+00 1.44066373e+00 6.65319293e+01
1716.lowfreq: -18.4669 -11.7929 -8.3399 -0.0004 -0.0004 0.0010 68.4594 124.9768 150.7100
frequency: 68.3401 124.9746 150.6749 192.8046 201.4187 220.0289 264.2947 309.6585 314.4733 356.6875 432.3199 450.6794 474.1422 490.5175 564.0287 631.9037 692.3981 765.1652 811.6584 854.1871 898.7823 906.7911 923.1692 954.4646 1036.9191 1074.6805 1097.2699 1110.4793 1116.9498 1126.0169 1154.4266 1183.3086 1247.7131 1269.9202 1285.2387 1297.4737 1334.3170 1346.5911 1357.3568 1383.2975 1386.5572 1388.8438 1413.7653 1429.0930 1453.8976 1460.8795 1464.8201 1476.2239 1479.1380 1621.1763 2934.0206 2940.7309 2977.7511 2992.6491 2993.0633 2997.2919 3060.5717 3087.6136 3088.1429 3094.5181 3104.4714 3108.1350 3526.5182
redmass: 4.1356 3.1689 2.8699 1.1449 1.3655 1.8645 2.1612 3.0178 3.1494 5.2942 3.0994 2.2213 2.4892 3.2993 1.8546 1.9135 3.7507 2.8783 3.2592 2.2670 1.6426 2.0704 1.8202 2.7050 1.9425 2.1897 2.8518 2.4274 2.2561 2.1581 2.1474 1.3107 1.2545 1.2841 1.3452 1.1920 1.4330 1.6619 1.4212 1.5772 1.2457 1.2760 1.7059 1.1395 1.1167 1.0482 1.1116 1.0481 1.0496 5.2038 1.0842 1.0840 1.0647 1.0366 1.0386 1.0606 1.0982 1.0988 1.0998 1.0992 1.0999 1.0993 1.0766
irintensity: 2.8998 3.8532 3.2231 0.1656 0.5924 0.3710 0.8281 2.2709 0.2961 1.9744 3.6408 5.4328 11.1617 4.6741 55.3536 40.8537 29.6535 7.2755 1.3004 5.0945 0.9741 8.5357 2.4563 43.8551 7.0041 65.9669 16.3673 3.9413 30.8107 4.2270 7.7910 36.1554 4.2468 2.2200 10.5823 23.0816 19.7471 49.6325 16.9361 68.3377 10.3535 20.6037 11.6244 34.0261 9.7632 4.5635 28.7225 6.4170 12.3831 339.0179 17.2185 58.7055 37.1576 33.9048 10.0728 19.5879 21.3013 4.7209 36.6594 37.8599 24.1338 24.3397 18.5990
temp: 298.150 k
press: 1.00000 atm
elementType: 8 8 7 6 6 6 6 6 6 6 1 1 1 1 1 1 1 1 1 1 1 1 1
symmnumber: 1
zpe: 514127.4 jmol-1
zpe.correction: 0.195821 hartree
zpe.thermalcorrener: 0.206297 hartree
zpe.thermalcorrenthalpy: 0.207241 hartree
zpe.thermalcorrgfe: 0.160444 hartree
zpe.sumelectzpe: -478.943953 hartree
zpe.sumelectthermal: -478.933477 hartree
zpe.sumelectthermalent: -478.932533 hartree
zpe.sumelectthermalfe: -478.979329 hartree
dipole: 3.4752 -0.8756 0.3306
dipole: 3.5990
quadrupole: -75.4339 -54.1295 -59.8653
quadrupole: -8.3836 -3.4021 -0.5635
quadrupole: -12.2910 9.0134 3.2776 -8.3836 -3.4021 -0.5635
hfenergy: -479.1397736 hartree
pointgroup: C01 [X(C7H13N1O2)]
dipole: 1.3408664 -0.437655 0.1243307 debye
dipolederiv: -0.7231733 0.2959281 0.1042558 0.2990109 -0.8706281 0.0399357 0.0620481 0.0194374 -0.4012934 -1.2056931 0.0735332 -0.1418946 -0.092518 -0.5662949 -0.0504263 -0.2830281 -0.0414679 -0.4176625 -0.9001979 0.152821 -0.0036075 0.5456273 -0.6074504 0.1455122 0.1146775 0.0273024 -0.4274879 0.3183602 -0.0606405 -0.083708 -0.218381 0.6674941 0.0341267 -0.1140184 0.1004211 0.3638299 0.6688261 -0.1912066 -0.0400288 -0.1152138 0.4989905 -0.0865884 -0.0297862 -0.1848297 0.3795101 0.479509 -0.0301925 0.0874043 0.0473589 0.0706879 0.0177571 0.0993521 0.0163007 0.246079 -0.1890102 -0.1629047 -0.0005653 -0.1582111 -0.2688365 -0.0610462 0.0288383 -0.053536 0.0309852 1.4929626 -0.2391957 0.2683443 -0.4075945 1.015854 0.0943334 0.294697 0.2085873 0.2225137 -0.1500253 0.0467793 -0.0008804 -0.007659 0.0064222 0.0271258 0.0231996 0.0140544 0.0718633 -0.0043613 -0.0358047 0.0154932 0.0099387 -0.1474707 -0.0170034 0.0224524 0.0149013 0.0725819 0.0072319 -0.0191623 -0.0910257 0.0369303 -0.0452071 0.003781 -0.0179418 -0.0541851 -0.1920116 -0.0359892 0.042756 -0.014011 -0.014503 -0.0050949 -0.0784382 -0.0429687 0.0082865 -0.1893323 0.0213496 0.0522318 -0.0103399 0.0929335 -0.1380234 -0.0080906 0.0019022 -0.0436357 0.0969125 -0.0327896 0.0019285 -0.010852 -0.0422833 0.0950111 -0.0829918 -0.047261 -0.0052508 -0.1277902 -0.0329616 0.1069299 0.0130848 0.064586 0.0065006 -0.0073378 -0.0137898 0.0069538 0.097694 0.0853535 -0.0237781 -0.092337 -0.03454 0.0474961 0.0360521 -0.0383275 0.0154093 -0.0785301 0.0979197 0.0167008 -0.0533058 0.0116736 0.1386991 -0.0457113 -0.0684607 -0.0552735 0.2862419 0.0547863 0.0405149 -0.0014415 0.093708 -0.1307125 -0.081636 0.0135529 -0.0820791 0.0684751 -0.0113308 -0.0699197 0.0516056 -0.1172001 0.0136542 0.077215 0.0652864 0.0738344 0.0505382 0.076674 0.010604 -0.002718 0.0004009 0.1023494 -0.009342 -0.0796574 0.0083483 -0.1353616 -0.0781831 0.127099 -0.0611889 0.0774674 0.0119499 0.0143363 -0.0585634 0.0250554 0.0802756 0.0996391 -0.0194503 -0.0259652 0.0009872 0.0754483 0.0074384 -0.0294786 -0.0675926 -0.1344824 -0.0388966 -0.1155714 0.0936814 -0.0725192 0.029161 0.0309985 0.097275 0.0489583 0.0364518 unknown
polarizability: 101.4115014|-6.1853504|93.0216609|3.0442063|1.3311413|66.5200219 unknown
InChI: InChI=1S/C7H13NO2/c1-5-3-7(9)8-4-6(2)10-5/h5-6,8H,3-4H2,1-2H3
charge 0 multiplicity 1
23 atoms
O  1.299611 0.796519 0.079393
O  -2.901855 -0.702494 -0.381229
N  -0.807617 -1.610506 -0.011379
C  1.499487 -0.602155 -0.349182
C  -0.009902 1.392919 -0.275175
C  0.593134 -1.580675 0.440497
C  -1.178404 0.78167 0.549038
C  -1.703892 -0.554708 0.01824
C  2.98572 -0.890577 -0.107441
C  0.146617 2.893326 -0.000488
H  1.254815 -0.691118 -1.432244
H  -0.19782 1.22318 -1.359458
H  0.996549 -2.603033 0.327701
H  0.660711 -1.314762 1.515127
H  -2.038283 1.471447 0.532976
H  -0.833392 0.679959 1.596973
H  -1.192353 -2.486934 -0.373646
H  3.261523 -1.888572 -0.493746
H  3.600193 -0.131882 -0.618701
H  3.220701 -0.850517 0.971301
H  -0.760212 3.440413 -0.313706
H  0.313744 3.073914 1.076248
H  1.011624 3.291589 -0.556399
