program: Gaussian 09
title: 000283958
version: EM64L-G09RevD.01
frameworkgroup: C1[X(C12H16N2O3S)]
method: RPBEPBE
basis: SDD
operation: Freq
keyword: #p
keyword: freq=noraman
keyword: PBEPBE/SDD
title: #p freq=noraman PBEPBE/SDD
converged: YES YES NO NO
title: Mulliken charges:
elementType: S O O O N N C C C C C C C C C C C C H H H H H H H H H H H H H H H H
charge: 0.809606 -0.550176 -0.546448 -0.103809 0.083526 -0.560397 -0.359950 0.489284 0.501215 0.499429 -0.656060 -0.579634 -0.801505 -0.835103 -0.071577 -0.812234 0.157525 -0.776056 0.242830 0.242273 0.268888 0.252997 0.204340 0.223605 0.232922 0.305093 0.226241 0.229868 0.234834 0.246131 0.287690 0.234883 0.355454 0.324314
chargesum: 0.00000
title: Mulliken charges with hydrogens summed into heavy atoms:
elementType: S O O O N N C C C C C C C C C C C C
charge: 0.809606 -0.550176 -0.546448 -0.103809 0.083526 0.119371 -0.359950 0.489284 0.501215 0.499429 -0.413229 -0.337361 -0.075280 -0.073483 -0.071577 -0.121290 0.157525 -0.007352
polarizability: 2.22217892e+02 -1.57011733e+01 1.89940593e+02 -2.26284725e-01 1.29232365e+01 1.59092218e+02
1716.lowfreq: -12.7411 -5.2271 -0.0015 -0.0009 0.0007 5.2068 19.0061 26.6865 29.8415
frequency: 18.3089 26.5218 29.6144 42.5914 59.6077 83.6110 109.2731 134.2579 144.5009 153.0846 172.8030 179.6628 182.4398 198.8379 212.4285 215.0539 227.7045 254.0283 277.3896 284.7344 297.4293 316.7313 343.2961 393.7075 411.0918 436.6848 499.9907 521.6994 525.3145 529.7396 545.0665 563.2721 572.1203 575.2267 598.4992 639.7104 669.9780 723.0081 780.8491 832.2090 868.9970 895.5792 902.4854 929.8439 943.3144 984.8883 988.8937 1017.4861 1024.8717 1028.2391 1042.7542 1046.6008 1050.4181 1053.5953 1189.4805 1210.0350 1219.1305 1257.5360 1305.9602 1309.3576 1354.3010 1387.5435 1393.8289 1399.3622 1402.4394 1412.2301 1416.1842 1454.2139 1462.5423 1464.2639 1470.6491 1471.2000 1477.0141 1478.3378 1489.7950 1544.5434 1589.7129 1597.9736 1656.3350 1721.9993 2963.7612 2978.4416 2980.1150 2995.7684 3039.3563 3057.7012 3062.0384 3085.2393 3086.7336 3093.2686 3097.9602 3112.0379 3119.7197 3123.0479 3432.0828 3647.3181
redmass: 3.9210 1.2017 3.1933 3.8143 3.8992 3.7548 3.9932 1.6227 1.2066 4.1521 1.6948 2.9599 3.7442 3.0829 3.7369 5.0750 2.7177 5.9104 2.8277 2.6651 4.9190 3.4105 5.9505 6.7859 1.7813 9.9051 2.9881 3.4432 4.6077 6.8005 5.2521 3.4115 4.1181 1.2986 7.0559 3.4922 1.7336 3.1100 12.0102 6.1082 1.3039 1.3160 13.5912 2.7889 3.0765 2.0354 3.6229 1.6387 1.4909 1.6778 1.5461 1.5481 1.5677 1.6283 1.4361 5.4710 1.7776 1.4502 3.9516 6.0833 5.9151 1.2201 1.6179 1.4664 1.3878 1.8966 1.5303 1.0476 1.0876 1.0475 1.0487 1.1214 1.0453 1.1445 1.1470 8.0674 7.1838 5.2418 1.1045 12.3896 1.0390 1.0374 1.0391 1.0369 1.0984 1.0973 1.0938 1.0958 1.0990 1.1011 1.1003 1.0956 1.0908 1.0917 1.0481 1.0987
irintensity: 1.3208 0.5911 3.2864 0.1984 2.3245 0.3264 1.1051 1.9928 0.7613 3.2770 0.0853 2.7985 10.7031 0.7730 5.3265 2.0176 2.0315 5.5918 4.3861 1.8594 2.0883 1.7953 0.8777 44.8078 2.7489 79.6975 0.9533 1.0547 1.2201 1.1569 3.7936 20.1697 30.6086 220.3079 7.7200 55.1530 5.1021 1.6441 93.4583 31.5406 19.7607 1.5560 74.8304 0.9092 0.6544 63.7330 11.9500 5.0405 2.0721 4.7347 3.5428 1.3180 0.4562 29.3183 0.2576 65.5646 18.1081 0.8405 39.5050 7.0065 4.5134 23.1740 8.4689 22.8253 12.3541 0.7573 12.7009 9.2039 10.4266 23.9447 12.0506 29.9852 17.0736 19.7958 41.4254 232.2535 18.1897 14.6520 43.1247 260.0460 21.6040 35.2077 21.0548 25.6217 14.4161 18.3444 27.0196 4.9245 16.8086 21.6270 5.7361 1.6809 24.5172 17.3150 31.2760 54.4686
temp: 298.150 k
press: 1.00000 atm
elementType: 16 8 8 8 7 7 6 6 6 6 6 6 6 6 6 6 6 6 1 1 1 1 1 1 1 1 1 1 1 1 1 1 1 1
symmnumber: 1
zpe: 685284.4 jmol-1
zpe.correction: 0.261011 hartree
zpe.thermalcorrener: 0.282028 hartree
zpe.thermalcorrenthalpy: 0.282973 hartree
zpe.thermalcorrgfe: 0.209494 hartree
zpe.sumelectzpe: -1198.568248 hartree
zpe.sumelectthermal: -1198.547231 hartree
zpe.sumelectthermalent: -1198.546287 hartree
zpe.sumelectthermalfe: -1198.619766 hartree
dipole: -1.0110 9.0208 -6.3599
dipole: 11.0836
quadrupole: -99.2835 -107.5312 -119.1463
quadrupole: 15.5104 -9.2254 2.8796
quadrupole: 9.3702 1.1224 -10.4926 15.5104 -9.2254 2.8796
hfenergy: -1198.8292592 hartree
pointgroup: C01 [X(C12H16N2O3S1)]
dipole: 0.2823375 -4.3513717 0.029343 debye
polarizability: 222.684548|-15.6018276|167.7993882|5.4774399|-17.7091083|180.7667659 unknown
InChI: InChI=1S/C12H16N2O3S/c1-7-5-8(2)11(9(3)6-7)18(16,17)12(15)10(4)14-13/h5-6H,13H2,1-4H3
charge 0 multiplicity 1
34 atoms
S  -0.821105 1.536013 0.605849
O  -1.131376 1.589086 2.21594
O  -0.817677 2.9592 -0.205912
O  -3.101837 1.051855 -1.099025
N  -1.608705 -1.326961 1.05199
N  -1.674467 -2.545383 1.606679
C  0.851172 0.645131 0.227715
C  1.674658 0.1908 1.288314
C  1.193135 0.513996 -1.145753
C  3.300205 -0.57796 -0.42919
C  2.902809 -0.420917 0.917126
C  2.431922 -0.10551 -1.442151
C  1.353003 0.321809 2.766107
C  0.313286 0.987606 -2.291207
C  -2.421171 0.429544 -0.281686
C  4.623625 -1.232078 -0.785147
C  -2.606403 -0.902951 0.271753
C  -3.857348 -1.691709 -0.061414
H  3.566239 -0.771799 1.717421
H  2.720391 -0.212017 -2.495484
H  1.267281 1.377669 3.074018
H  0.375531 -0.12522 3.013912
H  2.145879 -0.158589 3.365019
H  0.856058 0.907349 -3.247521
H  -0.605119 0.376443 -2.383701
H  -0.014636 2.03045 -2.142876
H  5.211288 -1.474881 0.116425
H  4.468019 -2.170727 -1.35016
H  5.238812 -0.569468 -1.421654
H  -4.457282 -1.896201 0.847803
H  -4.489026 -1.119662 -0.757977
H  -3.613523 -2.660154 -0.542608
H  -0.887815 -2.808342 2.195355
H  -2.465022 -3.189221 1.489342
