program: Gaussian 09
title: 000283930
version: EM64L-G09RevD.01
frameworkgroup: C1[X(C12H12O3)]
method: RPBEPBE
basis: SDD
operation: Freq
keyword: #pfreq=noraman
keyword: PBEPBE/SDD
title: #p freq=noraman PBEPBE/SDD
converged: YES YES NO NO
title: Mulliken charges:
elementType: O O O C C C C C C C C C C C C H H H H H H H H H H H H
charge: -0.195202 -0.163086 -0.163134 -0.279195 -0.279218 -0.420296 -0.420201 0.353355 -0.214659 -0.214720 0.178672 0.178990 0.128705 -0.775692 -0.775596 0.298130 0.298122 0.287116 0.287003 0.253384 0.253344 0.233533 0.225465 0.233129 0.225120 0.234038 0.232893
chargesum: 0.00000
title: Mulliken charges with hydrogens summed into heavy atoms:
elementType: O O O C C C C C C C C C C C C
charge: -0.195202 -0.163086 -0.163134 0.018935 0.018904 -0.133180 -0.133197 0.353355 0.038725 0.038624 0.178672 0.178990 0.128705 -0.083565 -0.083546
polarizability: 1.14716245e+02 6.19379566e+00 1.30130877e+02 8.09289329e-02 2.09973577e-02 1.33472343e+02
1716.lowfreq: -14.0920 -11.9366 -6.3509 -0.0003 0.0004 0.0005 46.3543 54.3115 97.0724
frequency: 46.3464 54.3108 97.0476 108.4036 132.5215 151.5716 192.5946 200.3214 224.6031 275.0962 347.3149 394.8354 397.6947 409.8884 475.0500 495.0482 535.4122 571.8112 608.3361 608.7152 648.6915 672.6586 745.0445 760.8644 802.7255 814.2380 828.9844 833.6929 883.8042 903.9268 912.5703 923.5868 942.1561 953.6339 967.1018 972.7736 997.3009 1039.4506 1073.5238 1082.0027 1090.7415 1095.5772 1120.7677 1132.9883 1143.3038 1202.4096 1208.0956 1234.5499 1247.0688 1255.9580 1269.8715 1271.8186 1301.2460 1390.8603 1402.2509 1453.9555 1465.3465 1470.0205 1475.1574 1575.8580 1693.5618 1744.8886 1761.8674 2968.8805 2972.6829 3040.1445 3043.3980 3066.6294 3078.5393 3096.4474 3099.5941 3117.7608 3122.0518 3166.2028 3197.7160
redmass: 8.1627 4.1994 1.2036 1.9320 7.7873 1.2783 4.7970 3.7361 3.4332 3.9445 3.6736 3.7329 3.8128 2.9189 3.8655 4.9755 3.6222 11.8361 4.2298 5.7843 8.7918 2.3460 3.2489 5.7546 7.4497 4.5418 5.7534 4.6356 3.0121 2.5394 2.7456 1.4394 1.8914 1.4835 2.8165 1.2991 2.0770 3.8000 1.2593 1.5838 1.3097 4.3951 2.8924 2.4729 1.3631 1.2466 1.3163 1.6324 3.5428 1.6258 1.4756 1.7455 1.8248 1.2437 1.2048 1.0489 1.0500 1.0440 1.0742 5.8122 12.9423 8.4213 12.5839 1.0383 1.0383 1.0973 1.0965 1.0855 1.0875 1.0972 1.0971 1.0891 1.0924 1.0878 1.1100
irintensity: 0.4702 4.0260 0.1367 0.1818 2.1315 0.6552 1.2858 1.3748 0.3475 3.9139 3.1605 2.1640 4.9256 5.0064 0.5363 2.5254 0.3730 2.9897 28.5602 15.6110 7.3634 10.7766 30.9357 4.2449 108.4325 28.0680 151.4737 13.2087 16.2720 0.8263 17.5545 0.8682 0.9079 0.3924 10.8845 0.7076 13.5610 82.4778 4.5434 1.0811 6.6163 0.2288 51.6306 118.0163 0.1788 0.1771 9.6292 1.8404 0.6763 3.2126 0.0338 4.8305 7.6184 30.0911 8.0388 0.6595 12.1882 23.8606 7.9324 2.2606 467.6164 8.7263 108.7884 16.9623 51.5574 0.0300 36.3018 2.7686 11.7705 16.4001 24.6787 22.3744 0.2879 3.0888 16.4746
temp: 298.150 k
press: 1.00000 atm
elementType: 8 8 8 6 6 6 6 6 6 6 6 6 6 6 6 1 1 1 1 1 1 1 1 1 1 1 1
symmnumber: 1
zpe: 550664.2 jmol-1
zpe.correction: 0.209737 hartree
zpe.thermalcorrener: 0.223087 hartree
zpe.thermalcorrenthalpy: 0.224031 hartree
zpe.thermalcorrgfe: 0.169605 hartree
zpe.sumelectzpe: -689.019190 hartree
zpe.sumelectthermal: -689.005841 hartree
zpe.sumelectthermalent: -689.004896 hartree
zpe.sumelectthermalfe: -689.059323 hartree
dipole: -3.1414 4.2379 -0.0134
dipole: 5.2753
quadrupole: -89.6644 -85.0807 -94.9415
quadrupole: 11.4484 -0.0726 -0.0706
quadrupole: 0.2312 4.8148 -5.0460 11.4484 -0.0726 -0.0706
hfenergy: -689.2289273 hartree
pointgroup: C01 [X(C12H12O3)]
dipole: -1.521853 -1.4109634 0.0253918 debye
polarizability: 112.9963779|-2.9813777|131.8515361|0.0953484|0.0678598|133.4715512 unknown
InChI: InChI=1S/C12H12O3/c1-5(2)8-6-3-4-7(8)10-9(6)11(13)15-12(10)14/h3-4,6-7,9-10H,1-2H3
charge 0 multiplicity 1
27 atoms
O  2.070834 0.964581 -0.025758
O  1.886911 0.655057 -2.333394
O  1.911669 0.708154 2.290174
C  0.870444 -1.011401 -0.775186
C  0.879944 -0.994332 0.781807
C  -0.683826 -0.894706 -1.132508
C  -0.669811 -0.870954 1.155659
C  -1.133147 0.040538 0.004829
C  -1.29956 -2.218325 -0.653753
C  -1.29181 -2.20385 0.711855
C  1.639346 0.235972 -1.200092
C  1.651741 0.263307 1.169525
C  -1.715932 1.265695 -0.003879
C  -2.059761 2.016458 1.271721
C  -2.077051 1.99054 -1.289622
H  1.32201 -1.901799 -1.239908
H  1.339017 -1.873545 1.260339
H  -0.869058 -0.60444 -2.174294
H  -0.842913 -0.559248 2.19336
H  -1.614749 -3.029679 -1.314013
H  -1.59928 -3.001061 1.392666
H  -1.563634 3.006232 1.282724
H  -3.149833 2.20541 1.328875
H  -1.757167 1.476446 2.183182
H  -3.165744 2.191702 -1.328175
H  -1.569433 2.973513 -1.33477
H  -1.800806 1.425237 -2.194063
