program: Gaussian 09
title: 000283925
version: EM64L-G09RevD.01
frameworkgroup: C1[X(C10H16O2)]
method: RPBEPBE
basis: SDD
operation: Freq
keyword: #pfreq=noraman
keyword: PBEPBE/SDD
title: #p freq=noraman PBEPBE/SDD
converged: YES YES NO NO
title: Mulliken charges:
elementType: O O C C C C C C C C C C H H H H H H H H H H H H H H H H
charge: -0.250455 -0.220536 -0.168810 0.269830 -0.588616 -0.457158 0.373726 -0.523335 0.152266 -0.780039 -0.732164 -0.737690 0.230765 0.226964 0.246837 0.221980 0.223180 0.244194 0.236399 0.225896 0.243654 0.200168 0.228839 0.210362 0.245382 0.209127 0.233435 0.235797
chargesum: 0.00000
title: Mulliken charges with hydrogens summed into heavy atoms:
elementType: O O C C C C C C C C C C
charge: -0.250455 -0.220536 0.061955 0.269830 -0.114815 -0.011997 0.373726 -0.042742 0.152266 -0.110322 -0.047580 -0.059330
polarizability: 1.24809606e+02 -4.48377672e+00 1.03233935e+02 -1.69567156e+00 1.96025842e-01 9.37742342e+01
1716.lowfreq: -18.2614 -0.0010 -0.0008 -0.0005 15.5346 23.5282 65.5180 72.1691 176.9469
frequency: 65.2152 72.0756 176.9398 187.3285 214.5598 219.7478 261.5975 274.1703 301.9112 314.8389 345.2191 350.1039 397.0902 433.1869 457.4096 491.0476 514.8584 591.8757 650.8256 687.9659 728.8254 796.0959 802.8907 827.1600 877.7379 888.4781 911.2020 929.8810 952.0361 966.8212 987.0451 997.3263 1016.9809 1043.6969 1053.3437 1087.8830 1120.9820 1138.2007 1166.6828 1188.5679 1195.2453 1214.2066 1232.3518 1258.9547 1273.1013 1286.7323 1303.1792 1322.3654 1336.2505 1380.0317 1392.0163 1397.5490 1449.0187 1462.2046 1463.2706 1468.5011 1473.0342 1476.7483 1480.7523 1485.8019 1500.3694 1646.5983 2986.7034 2991.2230 2994.7404 3001.2373 3004.4647 3012.1739 3031.1581 3059.9617 3069.7318 3080.7206 3086.4548 3087.8243 3092.6774 3095.9787 3102.5143 3106.2743
redmass: 2.9514 5.0125 1.4478 1.1986 1.2845 1.1028 2.3358 2.5937 2.9015 3.5944 2.4548 2.8257 2.2074 3.8587 3.4823 3.2916 3.7588 3.9357 4.1228 5.4493 3.0109 1.8324 2.2869 4.0477 3.0338 2.3397 2.1896 1.4798 1.7888 1.8526 1.8359 1.3369 1.4189 2.6848 2.0741 1.3833 1.7328 1.9768 2.1962 1.8013 2.4690 2.0260 2.0584 1.7764 1.4385 1.9085 1.4819 1.7914 1.6427 1.2288 1.2051 1.2054 1.0514 1.0609 1.0559 1.0707 1.0604 1.0673 1.0672 1.0722 1.0725 11.8671 1.0366 1.0364 1.0370 1.0629 1.0624 1.0690 1.0813 1.1014 1.1022 1.0997 1.1006 1.0986 1.0982 1.0988 1.0998 1.0993
irintensity: 1.3161 0.3692 0.9819 0.0765 0.3677 0.3714 0.0619 1.3003 1.7058 5.4130 0.5233 1.3134 2.0723 1.8994 4.2400 2.1267 4.3033 1.3282 2.1142 3.2485 1.2510 3.0019 1.1298 6.6624 22.5738 1.7776 14.7774 1.6550 8.5922 7.2731 2.2361 0.6344 21.2605 200.4151 90.4156 10.0396 19.8236 24.5305 8.7886 26.8855 1.2081 6.0319 15.1473 8.2503 5.6969 32.1300 1.4532 2.3695 6.5932 25.8413 15.4975 26.6096 1.8015 3.8424 5.5698 3.9469 7.0146 8.8049 19.5304 23.3640 5.0555 281.5135 23.4398 13.5240 16.3452 16.2991 36.3152 48.3255 45.5280 6.0610 13.3923 27.7381 36.1264 17.0639 41.0791 17.0932 26.9967 28.5914
temp: 298.150 k
press: 1.00000 atm
elementType: 8 8 6 6 6 6 6 6 6 6 6 6 1 1 1 1 1 1 1 1 1 1 1 1 1 1 1 1
symmnumber: 1
zpe: 632776.2 jmol-1
zpe.correction: 0.241012 hartree
zpe.thermalcorrener: 0.252966 hartree
zpe.thermalcorrenthalpy: 0.253910 hartree
zpe.thermalcorrgfe: 0.204170 hartree
zpe.sumelectzpe: -540.175033 hartree
zpe.sumelectthermal: -540.163080 hartree
zpe.sumelectthermalent: -540.162135 hartree
zpe.sumelectthermalfe: -540.211875 hartree
dipole: -1.9214 4.6484 1.8241
dipole: 5.3504
quadrupole: -70.6348 -81.3931 -72.0925
quadrupole: 4.7577 1.2447 -4.1463
quadrupole: 4.0720 -6.6863 2.6143 4.7577 1.2447 -4.1463
hfenergy: -540.4160451 hartree
pointgroup: C01 [X(C10H16O2)]
dipole: 0.8100884 -1.8153456 0.6923257 debye
polarizability: 125.053482|-3.8024507|102.9676766|1.8557348|-0.0098441|93.7966165 unknown
InChI: InChI=1S/C10H16O2/c1-9(2)7-4-5-10(3,6-7)8(11)12-9/h7H,4-6H2,1-3H3
charge 0 multiplicity 1
28 atoms
O  0.588264 1.237333 -0.399693
O  -1.507511 2.063547 -0.708578
C  0.842294 -1.120506 0.523705
C  -1.366362 -0.24428 0.174894
C  -0.442665 -0.76466 1.311543
C  0.261159 -1.951674 -0.658558
C  1.576674 0.19061 0.108932
C  -1.130604 -1.308476 -0.964959
C  -0.808217 1.103134 -0.326477
C  -2.843919 -0.091898 0.568658
C  2.27943 0.851313 1.312975
C  2.573394 0.013391 -1.050151
H  1.558531 -1.714561 1.121486
H  -0.884351 -1.672796 1.763331
H  -0.294975 -0.025148 2.117659
H  0.131146 -2.997597 -0.324476
H  0.922547 -1.97937 -1.539634
H  -1.17096 -0.842352 -1.965205
H  -1.940973 -2.058939 -0.924313
H  -2.97005 0.648559 1.378486
H  -3.447408 0.255501 -0.286731
H  -3.24322 -1.062976 0.915468
H  1.606198 0.957565 2.180137
H  3.153197 0.248582 1.622008
H  2.630993 1.857421 1.029145
H  3.298869 -0.787663 -0.816685
H  2.058966 -0.237941 -1.991593
H  3.127855 0.952987 -1.213469
