program: Gaussian 09
title: 000283919
version: EM64L-G09RevD.01
frameworkgroup: C1[X(C9H9N3O)]
method: RPBEPBE
basis: SDD
operation: Freq
keyword: #pfreq=noraman
keyword: PBEPBE/SDD
title: #p freq=noraman PBEPBE/SDD
converged: YES YES NO NO
title: Mulliken charges:
elementType: O N N N C C C C C C C C C H H H H H H H H H
charge: -0.291334 -0.368419 -0.352380 -0.645741 0.177604 0.364385 0.031216 0.115246 -0.393067 -0.399552 -0.234849 -0.223665 -0.245054 0.304924 0.331240 0.237289 0.254803 0.227724 0.227390 0.315289 0.335328 0.231623
chargesum: 0.00000
title: Mulliken charges with hydrogens summed into heavy atoms:
elementType: O N N N C C C C C C C C C
charge: -0.291334 -0.063496 -0.021140 0.004876 0.177604 0.364385 0.031216 0.115246 -0.155778 -0.144749 -0.007125 0.003725 -0.013430
polarizability: 2.08851640e+02 1.36396132e+01 1.28200589e+02 -1.75522881e+00 3.40564737e+00 5.53348065e+01
1716.lowfreq: -4.3085 -0.0008 -0.0007 -0.0002 6.7850 10.5212 66.7562 76.9502 111.7695
frequency: 66.7532 76.9484 111.7598 189.3715 245.9952 282.1206 309.1233 324.6187 359.4530 366.9184 409.8624 461.9009 492.1293 520.2220 563.0101 583.8607 615.0262 630.2819 700.9188 704.6333 719.9601 731.8018 772.9713 794.6527 856.3513 892.5018 923.4412 977.6797 988.2753 996.0470 1012.3838 1042.0425 1081.3819 1114.4289 1168.9741 1174.1771 1190.8686 1221.4477 1274.0298 1315.6245 1329.0090 1378.0258 1393.9037 1428.7384 1441.1460 1498.2876 1576.6794 1599.4134 1614.2547 1648.6106 1670.4611 3124.2042 3128.6835 3142.2739 3149.6812 3166.3621 3393.7562 3523.9593 3571.8159 3683.5096
redmass: 4.3862 5.6385 4.9438 6.4756 3.6530 4.9800 5.4708 1.8801 2.0493 3.9934 2.7844 2.9069 1.3625 1.1918 4.3435 3.6780 6.2923 5.9056 4.3477 1.8843 6.3264 4.5750 1.8893 2.3597 1.2470 3.6407 1.4217 1.8373 2.8340 1.3122 2.8985 1.8309 1.6560 3.1462 2.3502 1.0600 1.1276 6.2241 3.3230 1.3524 1.3195 6.0006 1.5273 2.9022 2.4191 3.0648 5.7928 1.4864 5.5673 3.5984 9.1576 1.0846 1.0873 1.0920 1.0965 1.1015 1.0770 1.0468 1.0806 1.1012
irintensity: 1.0944 1.0658 3.1374 2.2328 15.5697 8.2481 11.2563 84.6714 47.7249 4.1165 5.4646 4.9281 156.0911 212.0408 27.7963 21.0927 1.4721 19.2540 35.5867 34.9654 36.9442 81.5843 74.5827 109.4732 1.2709 11.5574 8.9750 0.3616 2.1014 0.8229 15.1286 0.4753 9.4307 2.2287 37.6618 0.5221 2.6092 43.6458 20.6181 2.0666 6.4314 4.4215 2.8267 32.7569 15.8486 12.2403 1.7623 281.1857 9.7260 332.3984 253.8073 5.6334 0.8279 8.8493 34.3674 24.5141 1.6904 91.9221 55.2285 28.9775
temp: 298.150 k
press: 1.00000 atm
elementType: 8 7 7 7 6 6 6 6 6 6 6 6 6 1 1 1 1 1 1 1 1 1
symmnumber: 1
zpe: 446965.1 jmol-1
zpe.correction: 0.170240 hartree
zpe.thermalcorrener: 0.181159 hartree
zpe.thermalcorrenthalpy: 0.182103 hartree
zpe.thermalcorrgfe: 0.133567 hartree
zpe.sumelectzpe: -586.898685 hartree
zpe.sumelectthermal: -586.887767 hartree
zpe.sumelectthermalent: -586.886823 hartree
zpe.sumelectthermalfe: -586.935359 hartree
dipole: -3.7362 -1.0916 0.2135
dipole: 3.8983
quadrupole: -87.1628 -58.8298 -79.0581
quadrupole: -6.1647 -0.2447 -2.6382
quadrupole: -12.1459 16.1871 -4.0412 -6.1647 -0.2447 -2.6382
hfenergy: -587.0689253 hartree
pointgroup: C01 [X(C9H9N3O1)]
dipole: 1.4670721 -0.4407885 -0.0751392 debye
dipolederiv: -1.5162368 0.3644657 0.0787712 0.2524078 -0.5718652 -0.0536254 0.1385582 -0.0474872 -0.3843866 -0.1370381 0.1458548 -0.0049161 0.3441472 -0.850414 0.1122313 -0.1846306 0.439626 0.0346046 -0.2866936 -0.2338356 -0.0426229 -0.1754707 -0.459317 -0.2506857 -0.2581889 -0.4160757 -0.4326676 -0.1570555 -0.0860972 0.0251068 0.739691 -1.2065984 -0.0319515 0.0692414 0.0228982 -0.616864 -0.2508378 0.3806115 0.0718121 -0.0853755 0.3517163 0.0016999 0.1378676 0.013516 -0.1001262 0.745796 -0.1997603 -0.0268424 0.0062975 -0.0379267 -0.0140811 -0.052983 0.0284645 0.0658093 -0.7178863 0.0606423 -0.0157051 -0.9424218 1.0666057 0.170197 -0.0209069 0.2045248 0.0980568 2.0618741 -0.5736996 -0.1168827 0.0116546 0.657398 0.1986754 -0.0526989 0.0884365 0.1941495 -0.2521422 0.02336 0.0405451 -0.1805763 0.0040117 -0.0617664 0.0168062 -0.069823 -0.1492531 -0.2696645 0.0621466 -0.0237761 0.1878865 -0.0552674 -0.0711136 -0.0118109 -0.092139 -0.158382 0.0876013 0.001173 -0.0183132 0.0841514 0.1140262 -0.0748831 -0.0337117 -0.0790079 -0.1241869 0.1014023 -0.0636979 0.0310346 -0.1194918 0.0935439 -0.071561 0.0571942 -0.0773388 -0.1202409 -0.0755923 0.0469613 0.0084716 0.0178837 -0.1258041 -0.0216166 -0.0068192 -0.0053112 -0.1706557 0.1354899 0.0053832 0.0345218 -0.0397813 0.3060938 -0.0540681 0.1167406 -0.2396241 0.1252708 0.1828077 0.0387844 0.0174983 0.0532336 0.2198167 0.0251213 0.1013469 0.1426008 0.370007 0.0306954 0.1003408 -0.0380039 0.0634804 -0.0054592 0.0539183 -0.0308328 0.0470721 0.1252624 0.0794849 -0.0893208 0.0232104 -0.0618338 -0.018245 0.05794 0.0388259 0.05278 0.1360042 0.0292049 -0.0675596 0.0180465 -0.1024736 -0.063987 0.0685777 0.0364537 0.0640739 0.1356293 -0.0040687 0.0900368 -0.0330404 0.1140751 -0.0382395 0.0639553 -0.0472007 0.0637996 0.134427 0.0915221 0.0002298 -0.0270156 -0.065575 0.2399335 -0.0346367 -0.0255812 -0.073182 0.3290858 0.2574045 0.0127399 0.0043467 -0.0797516 0.2861729 -0.0344781 0.0143588 -0.0840877 0.3469639 -0.1360674 -0.0187592 -0.0062465 -0.0221571 0.0938048 0.0221509 -0.0020285 0.016284 0.1614927 unknown
polarizability: 208.6574465|-14.2273169|128.3689353|-1.0249496|-3.8422794|55.3606531 unknown
InChI: InChI=1S/C9H9N3O/c10-7-8(11-12-9(7)13)6-4-2-1-3-5-6/h1-5,11-12H,10H2
charge 0 multiplicity 1
22 atoms
O  -4.012076 0.446498 0.08573
N  -1.098882 -1.584357 -0.168813
N  -2.506682 -1.37687 -0.311474
N  -1.556469 2.028373 0.307984
C  -0.519957 -0.266743 -0.044689
C  0.935173 -0.1243 -0.016318
C  -1.546466 0.667882 0.0575
C  -2.844289 -0.031834 -0.059482
C  1.559699 1.107789 -0.37265
C  1.766078 -1.22445 0.349334
C  2.963284 1.235563 -0.348795
C  3.169717 -1.093214 0.362282
C  3.777583 0.137828 0.019194
H  -0.7131 -2.152725 -0.939361
H  -3.132033 -2.152367 -0.087857
H  0.946741 1.948051 -0.718416
H  1.299344 -2.16716 0.656823
H  3.425121 2.188318 -0.631461
H  3.791541 -1.947727 0.652243
H  -0.72627 2.525334 0.615514
H  -2.473771 2.451285 0.455249
H  4.868016 0.239827 0.035563
