program: Gaussian 09
title: 000283941
version: EM64L-G09RevD.01
frameworkgroup: C1[X(C15H14O4)]
method: RPBEPBE
basis: SDD
operation: Freq
keyword: #pfreq=noraman
keyword: PBEPBE/SDD
title: #p freq=noraman PBEPBE/SDD
converged: YES YES NO NO
title: Mulliken charges:
elementType: O O O O C C C C C C C C C C C C C C C H H H H H H H H H H H H H H
charge: -0.530381 -0.408217 -0.227423 -0.348690 0.383303 0.020040 0.184262 0.082672 0.192758 -0.637966 0.115347 -0.580700 0.508752 -0.521131 0.063096 0.223398 -0.816224 -0.788059 -0.776734 0.256572 0.287799 0.263975 0.237192 0.237781 0.225904 0.251507 0.261046 0.238541 0.408629 0.255491 0.250263 0.266551 0.420643
chargesum: 0.00000
title: Mulliken charges with hydrogens summed into heavy atoms:
elementType: O O O O C C C C C C C C C C C C C C C
charge: -0.121752 0.012426 -0.227423 -0.348690 0.383303 0.020040 0.184262 0.082672 0.192758 -0.381393 0.115347 -0.292900 0.508752 -0.257156 0.063096 0.223398 -0.115347 -0.036965 -0.004429
polarizability: 2.99329453e+02 -6.17572063e+00 2.23068647e+02 5.18241770e-01 -3.29955318e+00 8.58337911e+01
1716.lowfreq: -9.7652 -5.8526 -1.4382 0.0001 0.0003 0.0008 43.4225 47.9118 54.9204
frequency: 43.3959 47.8957 54.9190 83.2861 89.5278 100.6632 149.6476 164.3470 174.8690 183.3939 198.7799 219.3800 274.0630 288.1821 295.1667 319.3226 326.1927 370.3293 384.2098 394.9027 471.4832 477.2741 514.3145 522.3931 547.6689 553.6946 570.1259 579.7405 603.9977 623.1412 660.2185 683.7956 706.6321 724.4591 786.0472 821.6196 843.3524 856.9077 869.5115 889.9848 912.2831 932.2185 976.9554 979.5527 986.9812 1006.0679 1021.7711 1029.7085 1046.3635 1075.4389 1101.8348 1161.3700 1206.9943 1212.2780 1232.9899 1252.5477 1287.2962 1333.3979 1361.5073 1373.3690 1380.0430 1386.8866 1397.9684 1399.1848 1416.7095 1430.8271 1447.4462 1450.5437 1453.7122 1455.8120 1461.2576 1467.0821 1477.9681 1539.0785 1539.6572 1555.1358 1573.3349 1609.7788 1644.3349 1903.2109 2980.7397 2986.2899 2993.7373 3058.0723 3059.7995 3074.6532 3078.2747 3090.9526 3117.3620 3130.6253 3153.8014 3161.1734 3191.5846
redmass: 1.4170 1.9502 4.3894 1.2290 3.5801 3.8281 4.1794 3.6509 6.0611 3.4055 1.8727 1.8649 3.4793 4.2888 4.2872 4.9730 6.4936 6.5883 3.2133 4.6427 5.0782 3.8175 5.4810 4.8736 6.2784 4.2282 3.4122 3.8798 3.9336 3.4710 4.0170 3.4998 4.5845 5.6245 3.3930 5.5477 1.1429 4.9140 1.5453 1.4075 3.8042 1.4773 2.2080 1.8349 3.0291 1.4544 1.7869 1.6985 1.5804 3.4157 4.3359 1.8415 2.2160 1.0590 1.8150 3.2817 2.2371 2.6663 3.5985 1.2305 2.3003 1.4648 2.3075 1.8968 4.1222 2.0759 2.4782 1.4624 1.4440 1.0466 1.0933 1.0501 1.3005 3.1876 3.6215 6.7832 4.1752 5.9404 4.4354 1.0852 1.0374 1.0385 1.0383 1.0674 1.0972 1.0964 1.0933 1.0991 1.1020 1.0993 1.0907 1.0924 1.0899
irintensity: 1.9203 0.4126 5.5632 1.9535 0.5901 0.8407 3.5368 7.5374 1.4094 1.7160 0.5402 0.6463 22.2382 1.3497 3.4198 0.7644 4.4288 1.9041 20.6787 1.1840 0.2895 1.5307 1.0176 13.8294 8.5875 2.0663 0.5828 18.1446 13.1156 51.9983 4.8070 5.1504 0.5652 8.7942 3.6507 11.0889 168.3171 8.0056 4.1312 0.4815 40.6830 18.4049 30.9243 50.1775 5.2579 1.0527 0.8957 7.4093 13.8458 7.3864 2.0886 48.5107 11.1325 146.5174 31.3057 358.2996 116.6005 0.0607 149.2307 57.1066 81.7449 127.9693 16.2382 35.3935 27.9589 43.6266 113.7916 35.3884 15.0911 22.1101 17.7677 12.8445 54.7421 44.8421 20.0740 382.5366 524.7529 366.5783 231.1079 323.2649 27.5507 2.8793 0.4081 177.8066 14.4326 5.4206 11.5709 17.6193 13.2744 12.0817 0.3647 4.6753 5.9530
temp: 298.150 k
press: 1.00000 atm
elementType: 8 8 8 8 6 6 6 6 6 6 6 6 6 6 6 6 6 6 6 1 1 1 1 1 1 1 1 1 1 1 1 1 1
symmnumber: 1
zpe: 658106.4 jmol-1
zpe.correction: 0.250659 hartree
zpe.thermalcorrener: 0.268320 hartree
zpe.thermalcorrenthalpy: 0.269264 hartree
zpe.thermalcorrgfe: 0.204940 hartree
zpe.sumelectzpe: -879.577485 hartree
zpe.sumelectthermal: -879.559825 hartree
zpe.sumelectthermalent: -879.558881 hartree
zpe.sumelectthermalfe: -879.623205 hartree
dipole: 1.4606 1.2426 0.9164
dipole: 2.1254
quadrupole: -92.2488 -128.9932 -112.8429
quadrupole: -0.3834 -0.5303 5.3781
quadrupole: 19.1128 -17.6315 -1.4813 -0.3834 -0.5303 5.3781
hfenergy: -879.8281447 hartree
pointgroup: C01 [X(C15H14O4)]
dipole: -0.5459359 -0.5042987 0.3832232 debye
polarizability: 299.7039832|-2.5033603|222.7202288|-3.1008639|-1.0659662|85.8076789 unknown
InChI: InChI=1S/C15H14O4/c1-7-4-12-10(8(2)16)6-11-9(3)18-20-19-15(11)14(12)13(17)5-7/h4-6,17H,1-3H3
charge 0 multiplicity 1
33 atoms
O  1.550468 2.471282 0.199907
O  -0.84067 3.333235 0.199749
O  0.690667 -3.853404 -0.208826
O  3.818008 1.704251 0.112391
C  -0.797874 -0.446981 0.152932
C  -0.312366 0.922075 0.177686
C  0.18447 -1.532843 0.161932
C  1.094654 1.179071 0.170019
C  2.047393 0.105397 0.115593
C  -2.203446 -0.650252 0.066793
C  -1.25745 2.018705 0.169496
C  1.548763 -1.233193 0.111439
C  -3.116097 0.429036 0.051252
C  -2.636319 1.76205 0.117014
C  -0.125379 -3.005971 0.268029
C  3.459429 0.43857 0.08691
C  -4.609071 0.175365 -0.039867
C  -1.345728 -3.511497 1.036374
C  4.545346 -0.604562 0.024893
H  -2.601976 -1.661851 -0.018704
H  2.246032 -2.076901 0.084838
H  -3.323681 2.613395 0.108809
H  -5.132934 0.573821 0.849238
H  -5.044409 0.67945 -0.92262
H  -4.837532 -0.900945 -0.114518
H  -1.734306 -2.782382 1.764822
H  -1.053894 -4.441878 1.551706
H  -2.158642 -3.777795 0.33354
H  2.695416 2.379107 0.165211
H  4.437478 -1.236986 -0.875051
H  4.499615 -1.277213 0.900902
H  5.525822 -0.106527 0.002782
H  0.177312 3.354173 0.218124
